Hexane, 2,3,3,4-tetramethyl-
- Formula: C10H22
- Molecular weight: 142.2817
- IUPAC Standard InChIKey: HIHSOGFAVTVMCY-UHFFFAOYSA-N
- CAS Registry Number: 52897-10-6
- Chemical structure:
View 3d structure (requires JavaScript / HTML 5) - Other names: 2,3,3,4-Tetramethylhexane

Phase change data

Data compiled as indicated in comments:
TRC - Thermodynamics Research Center, NIST Boulder Laboratories, Chris Muzny director
AC - William E. Acree, Jr., James S. Chickos
Quantity | Value | Units | Method | Reference | Comment |
---|---|---|---|---|---|
Tboil | 437.74 | K | N/A | Pomerantz, Mears, et al., 1949 | Uncertainty assigned by TRC = 0.2 K; TRC |
Quantity | Value | Units | Method | Reference | Comment |
ΔvapH° | 46.4 | kJ/mol | N/A | Reid, 1972 | AC |

Kovats' RI, non-polar column, isothermal

View large format table.

Column type Active phase Temperature (C) I Reference Comment
CapillarySqualane100.949.Heinzen, Soares, et al., 1999
CapillarySqualane60.949.1Chretien and Dubois, 1976
CapillarySqualane60.949.Matukuma, 1969N2; Column length: 91.4 m; Column diameter: 0.25 mm

Kovats' RI, non-polar column, custom temperature program

View large format table.

Column type Active phase I Reference Comment
CapillarySqualane946.Korol and Lysyuk, 1980Program: not specified

Normal alkane RI, non-polar column, custom temperature program

View large format table.

Column type Active phase I Reference Comment
CapillaryOV-101949.Du and Liang, 2003Program: not specified
CapillaryPolydimethyl siloxane949.Junkes, Castanho, et al., 2003Program: not specified

References

Pomerantz, Mears, et al., 1949
Pomerantz, P.; Mears, T.W.; Howard, F.L.,
Separation and Identification of the Major C1 to C10 Components of Triptene Residue,
J. Res. Natl. Bur. Stand. (U. S.), 1949, 42, 617-32. [all data]
Reid, 1972
Reid, Robert C.,
Handbook on vapor pressure and heats of vaporization of hydrocarbons and related compounds, R. C. Wilhort and B. J. Zwolinski, Texas A Research Foundation. College Station, Texas(1971). 329 pages.$10.00,
AIChE J., 1972, 18, 6, 1278-1278, https://doi.org/10.1002/aic.690180637
. [all data]