Hexane, 2,2,3,5-tetramethyl-
- Formula: C10H22
- Molecular weight: 142.2817
- IUPAC Standard InChIKey: GCFKTDRTZYDRBI-UHFFFAOYSA-N
- CAS Registry Number: 52897-09-3
- Chemical structure:
View 3d structure (requires JavaScript / HTML 5) - Other names: 2,2,3,5-Tetramethylhexane

Phase change data

Data compiled as indicated in comments:
TRC - Thermodynamics Research Center, NIST Boulder Laboratories, Chris Muzny director
AC - William E. Acree, Jr., James S. Chickos
Quantity | Value | Units | Method | Reference | Comment |
---|---|---|---|---|---|
Tboil | 422. | K | N/A | Whitmore, Goldsmith, et al., 1950 | Uncertainty assigned by TRC = 2. K; TRC |
Tboil | 421.6 | K | N/A | Fenske, Braun, et al., 1947 | Uncertainty assigned by TRC = 0.0003 K; TRC |
Quantity | Value | Units | Method | Reference | Comment |
ΔvapH° | 45.2 | kJ/mol | N/A | Reid, 1972 | AC |

Kovats' RI, non-polar column, isothermal

Data compiled by: NIST Mass Spectrometry Data Center, William E. Wallace, director

Column type CapillaryCapillaryCapillary
Active phase SqualaneSqualaneSqualane
Column length (m)   91.4
Carrier gas   N2
Substrate
Column diameter (mm)   0.25
Phase thickness (μm)
Temperature (C) 100.60.60.
I 873.873.3873.
ReferenceHeinzen, Soares, et al., 1999Chretien and Dubois, 1976Matukuma, 1969
Comment MSDC-RI MSDC-RI MSDC-RI

Kovats' RI, non-polar column, custom temperature program

View large format table.

Column type Active phase I Reference Comment
CapillarySqualane871.Korol and Lysyuk, 1980Program: not specified

Normal alkane RI, non-polar column, custom temperature program

View large format table.

Column type Active phase I Reference Comment
CapillaryOV-101873.Du and Liang, 2003Program: not specified
CapillaryPolydimethyl siloxane873.Junkes, Castanho, et al., 2003Program: not specified

References

Whitmore, Goldsmith, et al., 1950
Whitmore, F.C.; Goldsmith, D.P.J.; Cook, N.C.; Yarze, J.C.; Ecke, G.G.,
The Reaction of Mesityl Oxide with t-Butylmagnesium Chloride,
J. Am. Chem. Soc., 1950, 72, 53. [all data]
Fenske, Braun, et al., 1947
Fenske, M.R.; Braun, W.G.; Wiegand, R.V.; Quiggle, D.; McCormick, R.H.; Rank, D.H.,
Raman Spectra of Hydrocarbons,
Anal. Chem., 1947, 19, 700. [all data]
Reid, 1972
Reid, Robert C.,
Handbook on vapor pressure and heats of vaporization of hydrocarbons and related compounds, R. C. Wilhort and B. J. Zwolinski, Texas A Research Foundation. College Station, Texas(1971). 329 pages.$10.00,
AIChE J., 1972, 18, 6, 1278-1278, https://doi.org/10.1002/aic.690180637
. [all data]