Hexane, 4-ethyl-2,2-dimethyl-
- Formula: C10H22
- Molecular weight: 142.2817
- IUPAC Standard InChIKey: QHLDBFLIDFTHQI-UHFFFAOYSA-N
- CAS Registry Number: 52896-99-8
- Chemical structure:
View 3d structure (requires JavaScript / HTML 5) - Other names: 4-Ethyl-2,2-dimethylhexane; 2,2-Dimethyl-4-ethylhexane

Phase change data

Data compiled as indicated in comments:
TRC - Thermodynamics Research Center, NIST Boulder Laboratories, Chris Muzny director
AC - William E. Acree, Jr., James S. Chickos
Quantity | Value | Units | Method | Reference | Comment |
---|---|---|---|---|---|
Tboil | 420.2 | K | N/A | Braun, Spooner, et al., 1950 | Uncertainty assigned by TRC = 1.5 K; TRC |
Quantity | Value | Units | Method | Reference | Comment |
ΔvapH° | 45.2 | kJ/mol | N/A | Reid, 1972 | AC |

Kovats' RI, non-polar column, isothermal

View large format table.

Column type Active phase Temperature (C) I Reference Comment
CapillarySqualane100.881.Heinzen, Soares, et al., 1999
CapillarySqualane60.881.3Chretien and Dubois, 1976
CapillarySqualane60.881.Matukuma, 1969N2; Column length: 91.4 m; Column diameter: 0.25 mm

Normal alkane RI, non-polar column, custom temperature program

View large format table.

Column type Active phase I Reference Comment
CapillaryOV-101881.Du and Liang, 2003Program: not specified
CapillaryPolydimethyl siloxane881.Junkes, Castanho, et al., 2003Program: not specified

References

Braun, Spooner, et al., 1950
Braun, W.G.; Spooner, D.F.; Fenske, M.R.,
Raman spectra hydrocarbons and oxygenated compounds,
Anal. Chem., 1950, 22, 1074. [all data]
Reid, 1972
Reid, Robert C.,
Handbook on vapor pressure and heats of vaporization of hydrocarbons and related compounds, R. C. Wilhort and B. J. Zwolinski, Texas A Research Foundation. College Station, Texas(1971). 329 pages.$10.00,
AIChE J., 1972, 18, 6, 1278-1278, https://doi.org/10.1002/aic.690180637
. [all data]