Heptane, 2,3,3-trimethyl-
- Formula: C10H22
- Molecular weight: 142.2817
- IUPAC Standard InChIKey: QACXEXNKLFWKLK-UHFFFAOYSA-N
- CAS Registry Number: 52896-93-2
- Chemical structure:
View 3d structure (requires JavaScript / HTML 5) - Other names: 2,3,3-Trimethylheptane

Phase change data

Data compiled as indicated in comments:
TRC - Thermodynamics Research Center, NIST Boulder Laboratories, Chris Muzny director
AC - William E. Acree, Jr., James S. Chickos
Quantity | Value | Units | Method | Reference | Comment |
---|---|---|---|---|---|
Tboil | 433.2 | K | N/A | Cline, 1939 | Uncertainty assigned by TRC = 0.5 K; TRC |
Quantity | Value | Units | Method | Reference | Comment |
ΔvapH° | 46.9 | kJ/mol | N/A | Reid, 1972 | AC |

Kovats' RI, non-polar column, isothermal

Data compiled by: NIST Mass Spectrometry Data Center, William E. Wallace, director

Column type CapillaryCapillaryCapillary
Active phase SqualaneSqualaneSqualane
Column length (m)   91.4
Carrier gas   N2
Substrate
Column diameter (mm)   0.25
Phase thickness (μm)
Temperature (C) 100.60.60.
I 932.931.7932.
ReferenceHeinzen, Soares, et al., 1999Chretien and Dubois, 1976Matukuma, 1969
Comment MSDC-RI MSDC-RI MSDC-RI

References

Cline, 1939
Cline, E.T.,
The Synthesis of Type III and Type V Olefins from Dimethylbutadien- monohydrobromide, Ph.D. Dissertation, Ohio State Univ., Columbus, OH, 1939. [all data]
Reid, 1972
Reid, Robert C.,
Handbook on vapor pressure and heats of vaporization of hydrocarbons and related compounds, R. C. Wilhort and B. J. Zwolinski, Texas A Research Foundation. College Station, Texas(1971). 329 pages.$10.00,
AIChE J., 1972, 18, 6, 1278-1278, https://doi.org/10.1002/aic.690180637
. [all data]