Heptane, 2,2,3-trimethyl-
- Formula: C10H22
- Molecular weight: 142.2817
- IUPAC Standard InChIKey: ACYHSTUWOQNWCX-UHFFFAOYSA-N
- CAS Registry Number: 52896-92-1
- Chemical structure:
View 3d structure (requires JavaScript / HTML 5) - Other names: 2,2,3-Trimethylheptane

Phase change data

Data compiled by: William E. Acree, Jr., James S. Chickos
Quantity | Value | Units | Method | Reference | Comment |
---|---|---|---|---|---|
ΔvapH° | 46.9 | kJ/mol | N/A | Reid, 1972 |

Kovats' RI, non-polar column, isothermal

View large format table.

Column type Active phase Temperature (C) I Reference Comment
CapillarySqualane100.914.Heinzen, Soares, et al., 1999
CapillarySqualane60.914.4Chretien and Dubois, 1976
PackedSE-30110.922.Mitra, Mohan, et al., 1974N2, Chrom W; Column length: 6.1 m
PackedSE-30120.927.Mitra, Mohan, et al., 1974N2, Chrom W; Column length: 6.1 m
PackedSE-30130.930.Mitra, Mohan, et al., 1974N2, Chrom W; Column length: 6.1 m
PackedSE-30140.932.Mitra, Mohan, et al., 1974N2, Chrom W; Column length: 6.1 m
CapillarySqualane100.920.Mitra, Mohan, et al., 1974, 2H2; Column length: 50. m; Column diameter: 0.2 mm
PackedSqualane50.912.7Takács, Szita, et al., 1971N2, Chromosorb W; Column length: 3. m
CapillarySqualane60.914.Matukuma, 1969N2; Column length: 91.4 m; Column diameter: 0.25 mm

Normal alkane RI, non-polar column, custom temperature program

View large format table.

Column type Active phase I Reference Comment
CapillaryOV-101914.Du and Liang, 2003Program: not specified
CapillaryPolydimethyl siloxane914.Junkes, Castanho, et al., 2003Program: not specified

References

Reid, 1972
Reid, Robert C.,
Handbook on vapor pressure and heats of vaporization of hydrocarbons and related compounds, R. C. Wilhort and B. J. Zwolinski, Texas A Research Foundation. College Station, Texas(1971). 329 pages.$10.00,
AIChE J., 1972, 18, 6, 1278-1278, https://doi.org/10.1002/aic.690180637
. [all data]