Heptane, 4-ethyl-2-methyl-
- Formula: C10H22
- Molecular weight: 142.2817
- IUPAC Standard InChIKey: OJDKRASKNKPYDH-UHFFFAOYSA-N
- CAS Registry Number: 52896-88-5
- Chemical structure:
View 3d structure (requires JavaScript / HTML 5) - Other names: 4-Ethyl-2-methylheptane; 2-Methyl-4-ethylheptane

Phase change data

Data compiled by: William E. Acree, Jr., James S. Chickos
Quantity | Value | Units | Method | Reference | Comment |
---|---|---|---|---|---|
ΔvapH° | 47.3 | kJ/mol | N/A | Reid, 1972 |

References

Reid, 1972
Reid, Robert C.,
Handbook on vapor pressure and heats of vaporization of hydrocarbons and related compounds, R. C. Wilhort and B. J. Zwolinski, Texas A Research Foundation. College Station, Texas(1971). 329 pages.$10.00,
AIChE J., 1972, 18, 6, 1278-1278, https://doi.org/10.1002/aic.690180637
. [all data]