Thiocyanic acid, phenyl ester
- Formula: C7H5NS
- Molecular weight: 135.186
- IUPAC Standard InChIKey: YXCDJKQYFBEAOU-UHFFFAOYSA-N
- CAS Registry Number: 5285-87-0
- Chemical structure:
View 3d structure (requires JavaScript / HTML 5) - Other names: Phenyl thiocyanate; Phenylrhodanid

Condensed phase thermochemistry data

Data compiled by: Hussein Y. Afeefy, Joel F. Liebman, and Stephen E. Stein
Quantity | Value | Units | Method | Reference | Comment |
---|---|---|---|---|---|
ΔfH°liquid | 267. | kJ/mol | Ccb | Berthelot, 1901 | H2SO4.1.5H2O |
Quantity | Value | Units | Method | Reference | Comment |
ΔcH°liquid | -4340.52 | kJ/mol | Ccb | Berthelot, 1901 | H2SO4.1.5H2O |

Phase change data

Data compiled by: Robert L. Brown and Stephen E. Stein
Reduced pressure boiling point
Tboil (K) | Pressure (bar) | Reference |
---|---|---|
345.2 | 0.001 | Weast and Grasselli, 1989 |

References

Berthelot, 1901
Berthelot, M.,
Chimie Organique. - Nouvelles recherches sur l'isomerie des ethers sulfocyaniques,
Compt. Rend., 1901, 132, 57-58. [all data]
Weast and Grasselli, 1989
CRC Handbook of Data on Organic Compounds, 2nd Editon, Weast,R.C and Grasselli, J.G., ed(s)., CRC Press, Inc., Boca Raton, FL, 1989, 1. [all data]