D-cellobiose
- Formula: C12H22O11
- Molecular weight: 342.2965
- IUPAC Standard InChIKey: GUBGYTABKSRVRQ-BPUYHBCVSA-N
- CAS Registry Number: 528-50-7
- Chemical structure:
View 3d structure (requires JavaScript / HTML 5) - Stereoisomers:
- Other names: Cellobiose

Condensed phase thermochemistry data

Data compiled by: Hussein Y. Afeefy, Joel F. Liebman, and Stephen E. Stein
Quantity | Value | Units | Method | Reference | Comment |
---|---|---|---|---|---|
ΔcH°solid | -5401.5 | kJ/mol | Ccb | Gorokhov and Sryvalin, 1973 | Corresponding ΔfHºsolid = -2465. kJ/mol (simple calculation by NIST; no Washburn corrections) |

Phase change data

Data compiled by: William E. Acree, Jr., James S. Chickos
Enthalpy of sublimation
ΔsubH (kJ/mol) | Temperature (K) | Method | Reference | Comment |
---|---|---|---|---|
302. ± 44. | 481. | ME | Oja and Suuberg, 1999 | Based on data from 474. to 488. K. |

References

Gorokhov and Sryvalin, 1973
Gorokhov, G.I.; Sryvalin, I.T.,
Determination of the enthalpy of hydrolysis of carbohydrates from a homologous series of glucose,
Izv. Vyssh. Uchebn. Zaved., Khim. Khim. Tekhnol., 1973, 43-45. [all data]
Oja and Suuberg, 1999
Oja, V.; Suuberg, E.M.,
Vapor Pressures and Enthalpies of Sublimation of,
J. Chem. Eng. Data, 1999, 44, 1, 26-29, https://doi.org/10.1021/je980119b
. [all data]