1-Heptanamine, N,N-dimethyl-
- Formula: C9H21N
- Molecular weight: 143.2697
- IUPAC Standard InChIKey: LSICDRUYCNGRIF-UHFFFAOYSA-N
- CAS Registry Number: 5277-11-2
- Chemical structure:
View 3d structure (requires JavaScript / HTML 5) - Other names: Dimethylheptylamine; Dimethyl(n-heptyl)amine; N,N-dimethylheptylamine

Normal alkane RI, non-polar column, temperature ramp

Column type | Active phase | I | Reference | Comment |
---|---|---|---|---|
Capillary | Ultra-1 | 1102. | Okumura, 1991 | 25. m/0.32 mm/0.25 μm, He, 3. K/min; Tstart: 80. C; Tend: 260. C |

Phase change data

Data compiled by: Thermodynamics Research Center, NIST Boulder Laboratories, Chris Muzny director
Quantity | Value | Units | Method | Reference | Comment |
---|---|---|---|---|---|
Tboil | 443.15 | K | N/A | Gautier, Renault, et al., 1957 | Uncertainty assigned by TRC = 3. K |
Tboil | 445.15 | K | N/A | Von Braun, 1911 | Uncertainty assigned by TRC = 3. K |

References

Okumura, 1991
Okumura, T.,
retention indices of environmental chemicals on methyl silicone capillary column,
Journal of Environmental Chemistry (Japan), 1991, 1, 2, 333-358, https://doi.org/10.5985/jec.1.333
. [all data]