2,5-Cyclohexadiene-1,4-dione, 2,6-dimethyl-
- Formula: C8H8O2
- Molecular weight: 136.1479
- IUPAC Standard InChIKey: SENUUPBBLQWHMF-UHFFFAOYSA-N
- CAS Registry Number: 527-61-7
- Chemical structure:
View 3d structure (requires JavaScript / HTML 5) - Other names: p-Benzoquinone, 2,6-dimethyl-; m-Xyloquinone; 2,6-Dimethyl-p-benzoquinone; 2,6-Dimethyl-1,4-benzoquinone; 2,6-Dimethyl-1,4-quinone; 2,6-Dimethylbenzoquinone; 2,6-Dimethylquinone; 2,6-Xyloquinone; 2,6-Dimethylbenzo-1,4-quinone; 2,6-Dimethyl-2,5-cyclohexadien-1,4-dione; 3,5-Dimethylbenzoquinone; NSC 17549; 2,6-Dimethyl-2,5-cycloxehadien-1,4-dione

Gas phase ion energetics data

Data compiled by: John E. Bartmess
Electron affinity determinations
EA (eV) | Method | Reference | Comment |
---|---|---|---|
1.765 ± 0.061 | IMRE | Heinis, Chowdhury, et al., 1988 | ΔGea(423 K) = -39.3 kcal/mol; ΔSea (estimated) = -3.3 eu |
1.761 ± 0.048 | IMRE | Fukuda and McIver, 1985 | ΔGea(355 K) = -39.4 kcal/mol; ΔSea =-3.3, est. from data in Heinis, Chowdhury, et al., 1988 |

Kovats' RI, non-polar column, isothermal

Column type | Active phase | Temperature (C) | I | Reference | Comment |
---|---|---|---|---|---|
Packed | SE-30 | 180. | 1113. | Llobera and García-Raso, 1987 | N2, Chromosorb P AW DMCS; Column length: 2. m |
Packed | SE-30 | 190. | 1119. | Llobera and García-Raso, 1987 | N2, Chromosorb P AW DMCS; Column length: 2. m |
Packed | SE-30 | 200. | 1125. | Llobera and García-Raso, 1987 | N2, Chromosorb P AW DMCS; Column length: 2. m |
Packed | SE-30 | 210. | 1130. | Llobera and García-Raso, 1987 | N2, Chromosorb P AW DMCS; Column length: 2. m |

Kovats' RI, polar column, isothermal

Column type | Active phase | Temperature (C) | I | Reference | Comment |
---|---|---|---|---|---|
Packed | Carbowax 20M | 180. | 1681. | Llobera and García-Raso, 1987 | N2, Chromosorb P AW DMCS (60-80 mesh); Column length: 2. m |
Packed | Carbowax 20M | 190. | 1686. | Llobera and García-Raso, 1987 | N2, Chromosorb P AW DMCS (60-80 mesh); Column length: 2. m |
Packed | Carbowax 20M | 200. | 1695. | Llobera and García-Raso, 1987 | N2, Chromosorb P AW DMCS (60-80 mesh); Column length: 2. m |
Packed | Carbowax 20M | 210. | 1703. | Llobera and García-Raso, 1987 | N2, Chromosorb P AW DMCS (60-80 mesh); Column length: 2. m |

Normal alkane RI, polar column, temperature ramp

Column type | Active phase | I | Reference | Comment |
---|---|---|---|---|
Capillary | FFAP | 1711. | Budryn, Nebesny, et al., 2011 | 30. m/0.32 mm/0.50 μm, Nitrogen, 35. C @ 5. min, 4. K/min, 250. C @ 45. min |
Capillary | FFAP | 1711. | Nebesny, Budryn, et al., 2007 | 30. m/0.32 mm/0.5 μm, N2, 35. C @ 5. min, 4. K/min, 320. C @ 45. min |

References

Heinis, Chowdhury, et al., 1988
Heinis, T.; Chowdhury, S.; Scott, S.L.; Kebarle, P.,
Electron Affinities of Benzo-, Naphtho-, and Anthraquinones Determined from Gas-Phase Equilibria Measurements,
J. Am. Chem. Soc., 1988, 110, 2, 400, https://doi.org/10.1021/ja00210a015
. [all data]
Fukuda and McIver, 1985
Fukuda, E.K.; McIver, R.T., Jr.,
Relative electron affinities of substituted benzophenones, nitrobenzenes, and quinones. [Anchored to EA(SO2) from 74CEL/BEN],
J. Am. Chem. Soc., 1985, 107, 2291. [all data]
Llobera and García-Raso, 1987
Llobera, A.; García-Raso, A.,
Gas chromatographic behaviour of several p-quinones,
J. Chromatogr., 1987, 393, 2, 305-311, https://doi.org/10.1016/S0021-9673(01)94227-X
. [all data]
Budryn, Nebesny, et al., 2011
Budryn, G.; Nebesny, E.; Kula, J.; Majda, T.; Krysiak, W.,
HS-SPME/GC/MS Profiles of convectively and microwave roasted Ivory Coast Robusta coffee brews,
Czech. J. Food Sci., 2011, 29, 2, 151-160. [all data]
Nebesny, Budryn, et al., 2007
Nebesny, E.; Budryn, G.; Kula, J.; Majda, T.,
The effect of roasting method on headspace composition of robusta coffee bean aroma,
Eur. Food Res. Technol., 2007, 225, 1, 9-19, https://doi.org/10.1007/s00217-006-0375-0
. [all data]