Phenol, 3,4,5-trimethyl-
- Formula: C9H12O
- Molecular weight: 136.1910
- IUPAC Standard InChIKey: FDQQNNZKEJIHMS-UHFFFAOYSA-N
- CAS Registry Number: 527-54-8
- Chemical structure:
View 3d structure (requires JavaScript / HTML 5) - Other names: 1-Hydroxy-3,4,5-trimethylbenzene; 3,4,5-Hemimellitenol; 3,4,5-Trimethylphenol; 5-Hydroxy-1,2,3-trimethylbenzene

Phase change data

Data compiled as indicated in comments:
BS - Robert L. Brown and Stephen E. Stein
TRC - Thermodynamics Research Center, NIST Boulder Laboratories, Chris Muzny director
AC - William E. Acree, Jr., James S. Chickos
Quantity | Value | Units | Method | Reference | Comment |
---|---|---|---|---|---|
Tboil | 523. ± 3. | K | AVG | N/A | Average of 7 values; Individual data points |
Quantity | Value | Units | Method | Reference | Comment |
Tfus | 381. ± 3. | K | AVG | N/A | Average of 10 values; Individual data points |
Enthalpy of vaporization
ΔvapH (kJ/mol) | Temperature (K) | Method | Reference | Comment |
---|---|---|---|---|
61.1 | 411. | A | Stephenson and Malanowski, 1987 | Based on data from 396. to 521. K.; AC |

References

Stephenson and Malanowski, 1987
Stephenson, Richard M.; Malanowski, Stanislaw,
Handbook of the Thermodynamics of Organic Compounds, 1987, https://doi.org/10.1007/978-94-009-3173-2
. [all data]