Hydrazine, 1-butyl-1-ethyl-
- Formula: C6H16N2
- Molecular weight: 116.2046
- IUPAC Standard InChIKey: GGVXCUYZOPPOAM-UHFFFAOYSA-N
- CAS Registry Number: 52728-56-0
- Chemical structure:
View 3d structure (requires JavaScript / HTML 5) - Other names: 1-Ethyl-1-n-butylhydrazine

Normal alkane RI, non-polar column, temperature ramp

Column type | Active phase | I | Reference | Comment |
---|---|---|---|---|
Capillary | OV-101 | 862. | Zenkevich, 2005 | 25. m/0.20 mm/0.10 μm, N2/He, 6. K/min; Tstart: 50. C; Tend: 250. C |

References

Zenkevich, 2005
Zenkevich, I.G.,
Experimentally measured retention indices., 2005. [all data]