Hydrazine, 1,1-dimethyl-2-propyl-
- Formula: C5H14N2
- Molecular weight: 102.1781
- IUPAC Standard InChIKey: OZBIETPCMMGBGS-UHFFFAOYSA-N
- CAS Registry Number: 52728-54-8
- Chemical structure:
View 3d structure (requires JavaScript / HTML 5) - Other names: 1,1-Dimethyl-2-n-propylhydrazine

Normal alkane RI, non-polar column, temperature ramp

Column type | Active phase | I | Reference | Comment |
---|---|---|---|---|
Capillary | OV-101 | 708. | Zenkevich, 2005 | 25. m/0.20 mm/0.10 μm, N2/He, 6. K/min; Tstart: 50. C; Tend: 250. C |

References

Zenkevich, 2005
Zenkevich, I.G.,
Experimentally measured retention indices., 2005. [all data]