1,4-Dewar anthracene
- Formula: C14H10
- Molecular weight: 178.2292
- IUPAC Standard InChIKey: FMWFQVXKQPLDPL-UHFFFAOYSA-N
- CAS Registry Number: 52720-24-8
- Chemical structure:
View 3d structure (requires JavaScript / HTML 5) - Permanent link for this species. Use this link for bookmarking this species for future reference.

Reaction thermochemistry data

Data compiled by: Hussein Y. Afeefy, Joel F. Liebman, and Stephen E. Stein
Individual Reactions
By formula: C14H10 = C14H10
Quantity | Value | Units | Method | Reference | Comment |
---|---|---|---|---|---|
ΔrH° | -324. ± 1. | kJ/mol | Eqk | Dreeskamp, Kapahnke, et al., 1988 | liquid phase; solvent: Heptane; Isomerization |

References

Dreeskamp, Kapahnke, et al., 1988
Dreeskamp, H.; Kapahnke, P.; Tochtermann, W.,
Photo valence isomerization of sterically strained aromatic hydrocarbons: 8,9-dicarbethoxy[6]paracyclophane,
Radiat. Phys. Chem., 1988, 32, 537-539. [all data]