Benzene, 1,1',1''-ethylidynetris-
- Formula: C20H18
- Molecular weight: 258.3569
- IUPAC Standard InChIKey: QIDUHGHFWAMMPV-UHFFFAOYSA-N
- CAS Registry Number: 5271-39-6
- Chemical structure:
View 3d structure (requires JavaScript / HTML 5) - Other names: Ethane, 1,1,1-triphenyl-; 1,1,1-Triphenylethane

Condensed phase thermochemistry data

Data compiled as indicated in comments:
ALS - Hussein Y. Afeefy, Joel F. Liebman, and Stephen E. Stein
DH - Eugene S. Domalski and Elizabeth D. Hearing
Quantity | Value | Units | Method | Reference | Comment |
---|---|---|---|---|---|
ΔcH°solid | -10599.8 ± 2.0 | kJ/mol | Cm | Coops, Mulder, et al., 1953 | Reanalyzed by Cox and Pilcher, 1970, Original value = -10599. ± 2. kJ/mol; See Coops, Mulder, et al., 1946; Corresponding ΔfHºsolid = 157.1 kJ/mol (simple calculation by NIST; no Washburn corrections); ALS |
Constant pressure heat capacity of solid
Cp,solid (J/mol*K) | Temperature (K) | Reference | Comment |
---|---|---|---|
316.7 | 298.5 | Smith and Andrews, 1931 | T = 102 to 346 K. Value is unsmoothed experimental datum.; DH |

Phase change data

Data compiled as indicated in comments:
TRC - Thermodynamics Research Center, NIST Boulder Laboratories, Chris Muzny director
AC - William E. Acree, Jr., James S. Chickos
Quantity | Value | Units | Method | Reference | Comment |
---|---|---|---|---|---|
Tfus | 367. ± 1. | K | AVG | N/A | Average of 6 values; Individual data points |
Quantity | Value | Units | Method | Reference | Comment |
ΔsubH° | 108.6 ± 0.9 | kJ/mol | GS | Verevkin, 1999 | Based on data from 338. to 363. K.; AC |
Enthalpy of sublimation
ΔsubH (kJ/mol) | Temperature (K) | Method | Reference | Comment |
---|---|---|---|---|
105.4 ± 0.9 | 351. | GS | Verevkin, 1999 | Based on data from 338. to 363. K.; AC |
Enthalpy of fusion
ΔfusH (kJ/mol) | Temperature (K) | Method | Reference | Comment |
---|---|---|---|---|
19.95 | 375.9 | DSC | Verevkin, 1999 | AC |

References

Coops, Mulder, et al., 1953
Coops, J.; Mulder, D.; Dienske, J.W.; Smittenberg, J.,
Thermochemical investigations on arylethanes I. Heats of combustion of phenylethanes.,
Rec. Trav. Chim. Pays/Bas, 1953, 72, 785. [all data]
Cox and Pilcher, 1970
Cox, J.D.; Pilcher, G.,
Thermochemistry of Organic and Organometallic Compounds, Academic Press, New York, 1970, 1-636. [all data]
Coops, Mulder, et al., 1946
Coops, J.; Mulder, D.; Dienske, J.W.; Smittenberg, J.,
The heats of combustion of a number of hydrocarbons,
Rec. Trav. Chim. Pays/Bas, 1946, 65, 128. [all data]
Smith and Andrews, 1931
Smith, R.H.; Andrews, D.H.,
Thermal energy studies. I. Phenyl derivatives of methane,
ethane and some related compounds. J. Am. Chem. Soc., 1931, 53, 3644-3660. [all data]
Verevkin, 1999
Verevkin, Sergey P.,
Thermochemical Properties of Triphenylalkanes and Tetraphenylmethane. Strain in Phenyl Substituted Alkanes,
J. Chem. Eng. Data, 1999, 44, 3, 557-562, https://doi.org/10.1021/je9802726
. [all data]