4-methyl-1,6-heptadiene
- Formula: C8H14
- Molecular weight: 110.1968
- IUPAC Standard InChIKey: GWBIZSHSUHWEEP-UHFFFAOYSA-N
- CAS Registry Number: 52713-63-0
- Chemical structure:
View 3d structure (requires JavaScript / HTML 5) - Permanent link for this species. Use this link for bookmarking this species for future reference.

Phase change data

Data compiled by: Thermodynamics Research Center, NIST Boulder Laboratories, Chris Muzny director
Quantity | Value | Units | Method | Reference | Comment |
---|---|---|---|---|---|
Tboil | 382.4 | K | N/A | Butler, 1941 | Uncertainty assigned by TRC = 2. K |

References

Butler, 1941
Butler, J.M.,
, Ph.D. Thesis, Ohio State Univ., Columbus, OH, 1941. [all data]