4-Nonanol, (S)-
- Formula: C9H20O
- Molecular weight: 144.2545
- IUPAC Standard InChIKey: IXUOEGRSQCCEHB-SECBINFHSA-N
- CAS Registry Number: 52708-03-9
- Chemical structure:
View 3d structure (requires JavaScript / HTML 5) - Stereoisomers:

Phase change data

Data compiled by: Robert L. Brown and Stephen E. Stein
Reduced pressure boiling point
Tboil (K) | Pressure (bar) | Reference |
---|---|---|
367.7 | 0.024 | Weast and Grasselli, 1989 |

References

Weast and Grasselli, 1989
CRC Handbook of Data on Organic Compounds, 2nd Editon, Weast,R.C and Grasselli, J.G., ed(s)., CRC Press, Inc., Boca Raton, FL, 1989, 1. [all data]