Tetrasulfide, dipropyl
- Formula: C6H14S4
- Molecular weight: 214.435
- IUPAC Standard InChIKey: GJKGKILUTIBVOI-UHFFFAOYSA-N
- CAS Registry Number: 52687-98-6
- Chemical structure:
View 3d structure (requires JavaScript / HTML 5) - Other names: 1,4-Dipropyltetrasulfane; Dipropyl tetrasulfide; Di-n-propyl tetrasulfide; Dipropyl tetrasulphide

Kovats' RI, non-polar column, isothermal

Column type | Active phase | Temperature (C) | I | Reference | Comment |
---|---|---|---|---|---|
Capillary | OV-101 | 130. | 1526. | Misharina and Golovnya, 1989 | He; Column length: 50. m; Column diameter: 0.32 mm |

Van Den Dool and Kratz RI, non-polar column, temperature ramp

Column type | Active phase | I | Reference | Comment |
---|---|---|---|---|
Capillary | DB-1 | 1558. | Pino, Fuentes, et al., 2001 | He, 60. C @ 4. min, 4. K/min; Column length: 30. m; Column diameter: 0.32 mm; Tend: 250. C |
Capillary | Ultra-1 | 1520.4 | Farkas, Hradský, et al., 1992 | 25. m/0.2 mm/0.33 μm, H2, 2. K/min; Tstart: 60. C; Tend: 230. C |
Capillary | HP-1 | 1544. | Kuo and Ho, 1992 | 50. m/0.32 mm/1.05 μm, He, 2. K/min; Tstart: 40. C; Tend: 260. C |
Capillary | HP-1 | 1558. | Kuo and Ho, 1992, 2 | 50. m/0.32 mm/1.05 μm, He, 2. K/min; Tstart: 40. C; Tend: 260. C |
Capillary | OV-101 | 1536. | Misharina and Golovnya, 1989 | He, 4. K/min; Column length: 50. m; Column diameter: 0.32 mm; Tstart: 50. C; Tend: 250. C |

Van Den Dool and Kratz RI, non-polar column, custom temperature program

Column type | Active phase | I | Reference | Comment |
---|---|---|---|---|
Capillary | HP-5MS | 1570. | Andriamaharavo, 2014 | 30. m/0.25 mm/0.25 μm, He; Program: 60C (1 min) => 5 C/min => 210C => 10 C/min => 280C (15 min) |

Normal alkane RI, non-polar column, temperature ramp

Column type | Active phase | I | Reference | Comment |
---|---|---|---|---|
Capillary | HP-5 | 1569. | Kubec, Drhová, et al., 1999 | 30. m/0.25 mm/0.25 μm, N2, 40. C @ 3. min, 4. K/min, 240. C @ 10. min |
Capillary | DB-5 | 1573. | Sinha, Guyer, et al., 1992 | He, 2. K/min; Column length: 30. m; Column diameter: 0.2 mm; Tstart: 30. C; Tend: 200. C |

Normal alkane RI, non-polar column, custom temperature program

Column type | Active phase | I | Reference | Comment |
---|---|---|---|---|
Capillary | SE-30 | 1533. | Vinogradov, 2004 | Program: not specified |

References

Misharina and Golovnya, 1989
Misharina, T.A.; Golovnya, R.V.,
Regularities of retention of a pseudohomologous series of dialkylpolysulfides in capillary gas chromatography,
Zh. Anal. Khim., 1989, 44, 514-519. [all data]
Pino, Fuentes, et al., 2001
Pino, J.A.; Fuentes, V.; Correa, M.T.,
Volatile constituents of Chinese chive (Allium tuberosum Rottl. ex Sprengel) and Rakkyo (Allium chinense G. Don),
J. Agric. Food Chem., 2001, 49, 3, 1328-1330, https://doi.org/10.1021/jf9907034
. [all data]
Farkas, Hradský, et al., 1992
Farkas, P.; Hradský, P.; Kovác, M.,
Novel flavour components identified in the steamn distillate of onion (Allium cepa L.),
Z. Lebensm. Unters. Forsch., 1992, 195, 5, 459-462, https://doi.org/10.1007/BF01191718
. [all data]
Kuo and Ho, 1992
Kuo, M.-C.; Ho, C.-T.,
Volatile constituents of the distilled oils of Welsh onions (Allium fistulosum L. variety Maichuon) and scallions (Allium fistulosum L. variety Caespitosum),
J. Agric. Food Chem., 1992, 40, 1, 111-117, https://doi.org/10.1021/jf00013a021
. [all data]
Kuo and Ho, 1992, 2
Kuo, M.-C.; Ho, C.-T.,
Volatile constituents of the solvent extracts of Welsh onions (Allium fistulosum L. variety Maichuon) and scallions (A. fistulosum L. variety caepitosum),
J. Agric. Food Chem., 1992, 40, 10, 1906-1910, https://doi.org/10.1021/jf00022a036
. [all data]
Andriamaharavo, 2014
Andriamaharavo, N.R.,
Retention Data. NIST Mass Spectrometry Data Center., NIST Mass Spectrometry Data Center, 2014. [all data]
Kubec, Drhová, et al., 1999
Kubec, R.; Drhová, V.; Velísek, J.,
Volatile compounds thermally generated from S-propylcysteine and S-propylcysteine sulfoxide - aroma precursors of Allium vegetables,
J. Agric. Food Chem., 1999, 47, 3, 1132-1138, https://doi.org/10.1021/jf980974z
. [all data]
Sinha, Guyer, et al., 1992
Sinha, N.K.; Guyer, D.E.; Gage, D.A.; Lira, C.T.,
Supercritical carbon dioxide extraction of onion flavors and their analysis by gas chromatography-mass spectrometry,
J. Agric. Food Chem., 1992, 40, 5, 842-845, https://doi.org/10.1021/jf00017a027
. [all data]
Vinogradov, 2004
Vinogradov, B.A.,
Production, composition, properties and application of essential oils, 2004, retrieved from http://viness.narod.ru. [all data]