Fe-tetra(2-(NHCOtBu)phenyl)porphyrin radical

Gas phase ion energetics data

Data compiled by: John E. Bartmess

Electron affinity determinations

EA (eV) Method Reference Comment
2.070 ± 0.030IMREChen, Ellis, et al., 1994

References

Chen, Ellis, et al., 1994
Chen, H.L.; Ellis, P.E.; Wijesekera, T.; Hagan, T.E.; Groh, S.E.; Lyons, J.E.; Ridge, D.P., Correlation Between Gas-Phase Electron Affinities, Electrode Potentials, and Catalytic Activities of Halogenated Metalloporphyrins, J. Am. Chem. Soc., 1994, 116, 3, 1086, https://doi.org/10.1021/ja00082a034 . [all data]