Cyclohexanol, 2-methyl-5-(1-methylethyl)-, acetate, (1α,2β,5α)-
- Formula: C12H22O2
- Molecular weight: 198.3019
- IUPAC Standard InChIKey: JAKFDYGDDRCJLY-YUSALJHKSA-N
- CAS Registry Number: 5256-66-6
- Chemical structure:
- Other names: Carvomenthyl acetate; (1α,2β,5α)-5-(isopropyl)-2-methylcyclohexyl acetate

Kovats' RI, non-polar column, isothermal

Column type | Active phase | Temperature (C) | I | Reference | Comment |
---|---|---|---|---|---|
Packed | Apiezon L | 150. | 1281. | ter Heide, 1968 | N2, Embacel; Column length: 2.5 m |

Kovats' RI, polar column, isothermal

Column type | Active phase | Temperature (C) | I | Reference | Comment |
---|---|---|---|---|---|
Packed | Carbowax 20M | 150. | 1641. | ter Heide, 1968 | N2, Embacel; Column length: 2.5 m |

Normal alkane RI, non-polar column, custom temperature program

Column type | Active phase | I | Reference | Comment |
---|---|---|---|---|
Capillary | SE-30 | 1278. | Vinogradov, 2004 | Program: not specified |
Capillary | Methyl Silicone | 1278. | Zenkevich, 1999 | Program: not specified |

Normal alkane RI, polar column, custom temperature program

Column type | Active phase | I | Reference | Comment |
---|---|---|---|---|
Capillary | Carbowax 20M | 1639. | Vinogradov, 2004 | Program: not specified |

References

ter Heide, 1968
ter Heide, R.,
Studies on terpenes. II. Characterization of monoterpene esters by gas and thin-layer chromatography,
Z. Anal. Chem., 1968, 236, 215-227. [all data]
Vinogradov, 2004
Vinogradov, B.A.,
Production, composition, properties and application of essential oils, 2004, retrieved from http://viness.narod.ru. [all data]
Zenkevich, 1999
Zenkevich, I.G.,
Analytical Parameters of Components of essential Oils for their Gas Chromatographic and Chromato-Mass-Spectral Identification. Acetates of Terpene Alcohols,
Rastitelnye Resursy (Plant Resources), 1999, 35, 1, 30-37. [all data]