L-Methionine, N-(trifluoroacetyl)-, TMS derivative
- Formula: C10H18F3NO3SSi
- Molecular weight: 317.401
- IUPAC Standard InChIKey: XTJJUKGBAFRTRJ-SSDOTTSWSA-N
- CAS Registry Number: 52558-92-6
- Chemical structure:
View 3d structure (requires JavaScript / HTML 5) - Other names: L-Methionine, N-(trifluoroacetyl)-, trimethylsilyl ester; Trimethylsilyl 4-(methylsulfanyl)-2-[(trifluoroacetyl)amino]butanoate

Van Den Dool and Kratz RI, non-polar column, custom temperature program

Column type | Active phase | I | Reference | Comment |
---|---|---|---|---|
Capillary | VF-5MS | 1463.1 | Tret'yakov, 2008 | 30. m/0.25 mm/0.25 μm, He; Program: Multi-step temperature program; T(initial)=60C; T(final)=270C |

References

Tret'yakov, 2008
Tret'yakov, K.V.,
Retention Data. NIST Mass Spectrometry Data Center., NIST Mass Spectrometry Data Center, 2008. [all data]