L-Threonine, N-(trifluoroacetyl)-, trimethylsilyl ester, trifluoroacetate (ester)
- Formula: C11H15F6NO5Si
- Molecular weight: 383.3164
- IUPAC Standard InChIKey: OMNIFVPZYCPNJD-NTSWFWBYSA-N
- CAS Registry Number: 52558-90-4
- Chemical structure:
View 3d structure (requires JavaScript / HTML 5) - Other names: L-Threonine, N,O-di(trifluoroacetyl)-, trimethylsilyl ester; Trimethylsilyl 2-[(trifluoroacetyl)amino]-3-[(trifluoroacetyl)oxy]butanoate

Van Den Dool and Kratz RI, non-polar column, custom temperature program

Column type | Active phase | I | Reference | Comment |
---|---|---|---|---|
Capillary | VF-5MS | 1146.6 | Tret'yakov, 2008 | 30. m/0.25 mm/0.25 μm, He; Program: Multi-step temperature program; T(initial)=60C; T(final)=270C |

References

Tret'yakov, 2008
Tret'yakov, K.V.,
Retention Data. NIST Mass Spectrometry Data Center., NIST Mass Spectrometry Data Center, 2008. [all data]