L-Tryptophan, N,1-bis(trifluoroacetyl)-, trimethylsilyl ester
- Formula: C18H18F6N2O4Si
- Molecular weight: 468.4224
- IUPAC Standard InChIKey: NBYQGSUOFPKPRP-LBPRGKRZSA-N
- CAS Registry Number: 52558-86-8
- Chemical structure:

Van Den Dool and Kratz RI, non-polar column, custom temperature program

Column type | Active phase | I | Reference | Comment |
---|---|---|---|---|
Capillary | VF-5MS | 1973.8 | Tret'yakov, 2008 | 30. m/0.25 mm/0.25 μm, He; Program: Multi-step temperature program; T(initial)=60C; T(final)=270C |

References

Tret'yakov, 2008
Tret'yakov, K.V.,
Retention Data. NIST Mass Spectrometry Data Center., NIST Mass Spectrometry Data Center, 2008. [all data]