L-Tyrosine, N-(trifluoroacetyl)-, trimethylsilyl ester, trifluoroacetate (ester)
- Formula: C16H17F6NO5Si
- Molecular weight: 445.3858
- IUPAC Standard InChIKey: VHSNWYDUWJNFEE-LLVKDONJSA-N
- CAS Registry Number: 52558-85-7
- Chemical structure:
View 3d structure (requires JavaScript / HTML 5) - Other names: Trimethylsilyl 2-[(trifluoroacetyl)amino]-3-(4-[(trifluoroacetyl)oxy]phenyl)propanoate, (L)-; L-Tyrosine, N,O-di(trifluoroacetyl)-, trimethylsilyl ester; Trimethylsilyl 2-[(trifluoroacetyl)amino]-3-(4-[(trifluoroacetyl)oxy]phenyl)propanoate

Van Den Dool and Kratz RI, non-polar column, custom temperature program

Column type | Active phase | I | Reference | Comment |
---|---|---|---|---|
Capillary | VF-5MS | 1664.3 | Tret'yakov, 2008 | 30. m/0.25 mm/0.25 μm, He; Program: Multi-step temperature program; T(initial)=60C; T(final)=270C |

References

Tret'yakov, 2008
Tret'yakov, K.V.,
Retention Data. NIST Mass Spectrometry Data Center., NIST Mass Spectrometry Data Center, 2008. [all data]