L-Isoleucine, N-trifluoroacetyl-, TMS derivative
- Formula: C11H20F3NO3Si
- Molecular weight: 299.3621
- IUPAC Standard InChIKey: PJGCYZHBTYCJIE-HTQZYQBOSA-N
- CAS Registry Number: 52558-83-5
- Chemical structure:
View 3d structure (requires JavaScript / HTML 5) - Other names: l-Isoleucine, N-(trifluoroacetyl)-, trimethylsilyl ester; Trimethylsilyl 3-methyl-2-[(trifluoroacetyl)amino]pentanoate

Van Den Dool and Kratz RI, non-polar column, custom temperature program

Column type | Active phase | I | Reference | Comment |
---|---|---|---|---|
Capillary | VF-5MS | 1242.5 | Tret'yakov, 2008 | 30. m/0.25 mm/0.25 μm, He; Program: Multi-step temperature program; T(initial)=60C; T(final)=270C |

References

Tret'yakov, 2008
Tret'yakov, K.V.,
Retention Data. NIST Mass Spectrometry Data Center., NIST Mass Spectrometry Data Center, 2008. [all data]