3-Cyclohexene-1-carboxaldehyde, 3-(4-methyl-3-pentenyl)-
- Formula: C13H20O
- Molecular weight: 192.2973
- IUPAC Standard InChIKey: RKXHUEKKGCBVSR-UHFFFAOYSA-N
- CAS Registry Number: 52475-89-5
- Chemical structure:
View 3d structure (requires JavaScript / HTML 5) - Other names: Myrac aldehyde 1; 3-Cyclohexene-1-carboxaldehyde, 3-(4-methyl-3-penten-1-yl)-; 1-Formyl-3-(3-isohexenyl)-3-cyclohexene; m-Myrac aldehyde; 3-(4-methyl-3-pentenyl)cyclohex-3-ene-1-carbaldehyde

Kovats' RI, non-polar column, isothermal

Column type | Active phase | Temperature (C) | I | Reference | Comment |
---|---|---|---|---|---|
Capillary | SE-30 | 100. | 1490.8 | Tudor, 1997 | 40. m/0.35 mm/0.35 μm |

References

Tudor, 1997
Tudor, E.,
Temperature dependence of the retention index for perfumery compounds on a SE-30 glass capillary column. I. Linear equations,
J. Chromatogr. A, 1997, 779, 1-2, 287-297, https://doi.org/10.1016/S0021-9673(97)00453-6
. [all data]