2-Propanol, 1,1,1,3,3,3-hexafluoro-2-[2-(1-methylethyl)phenoxy]-
- Formula: C12H12F6O2
- Molecular weight: 302.2129
- IUPAC Standard InChIKey: DGWCUQRDBNRYAK-UHFFFAOYSA-N
- CAS Registry Number: 52447-66-2
- Chemical structure:
View 3d structure (requires JavaScript / HTML 5) - Permanent link for this species. Use this link for bookmarking this species for future reference.

Reaction thermochemistry data

Data compiled by: Hussein Y. Afeefy, Joel F. Liebman, and Stephen E. Stein
Individual Reactions
By formula: C9H12O + C3F6O = C12H12F6O2
Quantity | Value | Units | Method | Reference | Comment |
---|---|---|---|---|---|
ΔrH° | -56.5 | kJ/mol | Eqk | N/A | liquid phase; solvent: Ethyl acetate; Flourene NMR |

References

No reference data available.