Allobarbital
- Formula: C10H12N2O3
- Molecular weight: 208.2139
- IUPAC Standard InChIKey: FDQGNLOWMMVRQL-UHFFFAOYSA-N
- CAS Registry Number: 52-43-7
- Chemical structure:
View 3d structure (requires JavaScript / HTML 5) - Other names: 2,4,6(1H,3H,5H)-Pyrimidinetrione, 5,5-di-2-propenyl-; Barbituric acid, 5,5-diallyl-; Allobarbitone; Allylbarbitural; Alnox; Barballyl; Barbidal; Curral; Diadol; Dial; Dial (barbiturate); Diallylbarbital; Diallymal; Dorm; Dormallyl; Malil; Malilum; Novallyl; 5,5-Diallylbarbituric acid; Allbarbital; Alobarbital; Allybarbitural; NSC-9324; 5,5-Di-2-propenyl-2,4,6(1H,3H,5H)-pyrimidinetrione

Phase change data

Data compiled as indicated in comments:
TRC - Thermodynamics Research Center, NIST Boulder Laboratories, Chris Muzny director
AC - William E. Acree, Jr., James S. Chickos
Quantity | Value | Units | Method | Reference | Comment |
---|---|---|---|---|---|
Tfus | 445. | K | N/A | Kuffner, Bush, et al., 1957 | Uncertainty assigned by TRC = 4. K; not clear that this was measured by author; TRC |
Enthalpy of fusion
ΔfusH (kJ/mol) | Temperature (K) | Reference | Comment |
---|---|---|---|
32.31 | 442.6 | Chauvet, De Maury, et al., 1986 | AC |

Kovats' RI, non-polar column, isothermal

Data compiled by: NIST Mass Spectrometry Data Center, William E. Wallace, director

Column type CapillaryPackedPacked
Active phase SPB-1SE-30OV-1
Column length (m) 25.
Carrier gas He
Substrate
Column diameter (mm) 0.20
Phase thickness (μm)
Temperature (C) 250.200.200.
I 1609.1586.1610.
ReferenceLora-Tamayo, Rams, et al., 1986Stead, Gill, et al., 1982Berninger and Möller, 1977
Comment MSDC-RI MSDC-RI MSDC-RI

Kovats' RI, non-polar column, temperature ramp

View large format table.

Column type Active phase I Reference Comment
PackedSE-301595.Maurer, 1990N2, 100. C @ 3. min, 30. K/min, 310. C @ 5. min
CapillarySE-301577.Schepers, Wijsbeek, et al., 198212. m/0.22 mm/0.45 μm, He, 120. C @ 2. min, 8. K/min, 300. C @ 12. min
CapillarySE-301577.Schepers, Wijsbeek, et al., 198225. m/0.49 mm/1.14 μm, 100. C @ 2. min, 8. K/min, 275. C @ 15. min

Van Den Dool and Kratz RI, non-polar column, temperature ramp

View large format table.

Column type Active phase I Reference Comment
CapillarySPB-11609.Christ, Noomano, et al., 198830. m/0.75 mm/1.0 μm, He, 10. K/min, 280. C @ 12. min; Tstart: 160. C
CapillaryDB-11575.Perrigo, Peel, et al., 198515. m/0.32 mm/0.25 μm, He, 8. K/min, 280. C @ 5. min; Tstart: 120. C
CapillaryDB-11575.Perrigo, Ballantyne, et al., 198415. m/0.25 mm/0.25 μm, He, 8. K/min, 280. C @ 5. min; Tstart: 120. C
PackedSE-301605.Perrigo and Peel, 1981N2, Chromosorb W, 130. C @ 2. min, 8. K/min, 290. C @ 8. min; Column length: 1.8 m

Normal alkane RI, non-polar column, temperature ramp

View large format table.

Column type Active phase I Reference Comment
CapillaryBP-11575.MHA, 9999Tstart: 100. C; Tend: 300. C
CapillaryDB-11564.Anderson and Fuller, 198710. m/0.53 mm/2.65 μm, He, 5. K/min; Tstart: 130. C; Tend: 230. C
PackedSE-301575.Marozzi, Gambaro, et al., 1982Gas Chrom P, 2.5 K/min; Column length: 2. m; Tstart: 120. C; Tend: 200. C
PackedSE-301604.Peel and Perrigo, 1976Nitrogen, Chromosorb W AW DMS (80-100 mesh), 130. C @ 2. min, 8. K/min, 290. C @ 8. min; Column length: 2. m
PackedSE-301604.Peel and Perrigo, 1975N2, Chromosorb W AW DMS, 130. C @ 2. min, 8. K/min, 290. C @ 8. min; Column length: 2. m

Normal alkane RI, non-polar column, custom temperature program

View large format table.

Column type Active phase I Reference Comment
CapillaryPolydimethyl siloxanes1606.Schutz and Wollrab A., 1988Program: not specified
OtherMethyl Silicone1606.Ardrey and Moffat, 1981Program: not specified

References

Kuffner, Bush, et al., 1957
Kuffner, R.J.; Bush, M.T.; Bircher, L.J.,
Studies on the surface tension of aqueous barbituric acid solutions,
J. Am. Chem. Soc., 1957, 79, 1587-1589. [all data]
Chauvet, De Maury, et al., 1986
Chauvet, A.; De Maury, G.; Terol, A.; Masse, J.,
Etude thermoanalytique de substances psychotropes,
Thermochimica Acta, 1986, 97, 143-159, https://doi.org/10.1016/0040-6031(86)87015-0
. [all data]