Bicyclo[2.2.1]heptane-2-methanol
- Formula: C8H14O
- Molecular weight: 126.1962
- IUPAC Standard InChIKey: LWHKUVOYICRGGR-UHFFFAOYSA-N
- CAS Registry Number: 5240-72-2
- Chemical structure:
View 3d structure (requires JavaScript / HTML 5) - Other names: 2-Norbornanemethanol; CPC 1207; Experimental chemotherapeutant 1,207; 2-(Hydroxymethyl)bicyclo[2.2.1]heptane; 2-(Hydroxymethyl)norbornane; 2-(Hydroxymethyl)norcamphane; 2-Norbornylmethanol; 2-Norcamphanemethanol; Bicyclo(2,2,1)heptane-2-carbinol; Bicyclo[2.2.1]heptane-2-carbinol; EC-1207; CC 1207; 2-Norcamphanylmethanol; 2-Norkamfanylmethanol; Methanol, 2-norbornane-; NSC 53599; NSC 55693; (Bicyclo[2.2.1]hept-2-yl)methanol

Phase change data

Data compiled by: Robert L. Brown and Stephen E. Stein
Reduced pressure boiling point
Tboil (K) | Pressure (bar) | Reference |
---|---|---|
367.2 | 0.019 | Aldrich Chemical Company Inc., 1990 |
374. to 375. | 0.013 | Frinton Laboratories Inc., 1986 |

References

Aldrich Chemical Company Inc., 1990
Aldrich Chemical Company Inc.,
Catalog Handbook of Fine Chemicals, Aldrich Chemical Company, Inc., Milwaukee WI, 1990, 1. [all data]
Frinton Laboratories Inc., 1986
Frinton Laboratories Inc.,
Catalog Number 11, Frinton Laboratories Inc., Vineland, NJ, 1986, 99. [all data]