Apiol
- Formula: C12H14O4
- Molecular weight: 222.2372
- IUPAC Standard InChIKey: QQRSPHJOOXUALR-UHFFFAOYSA-N
- CAS Registry Number: 523-80-8
- Chemical structure:
View 3d structure (requires JavaScript / HTML 5) - Other names: 1,3-Benzodioxole, 4,7-dimethoxy-5-(2-propenyl)-; Benzene, 1-allyl-2,5-dimethoxy-3,4-(methylenedioxy)-; Apiole; Apioline; Parsley apiole; Parsley camphor; 1-Allyl-2,5-dimethoxy-3,4-(methylenedioxy)benzene; 4,7-Dimethoxy-5-(2-propenyl)-1,3-benzodioxole; 1,3-Benzodioxole, 4,7-dimethoxy-5-(2-propen-1-yl)-; NSC 9070; Green Apiol; 5-allyl-4,7-dimethoxy-1,3-benzodioxole; 4,7-Dimethoxy-5-(2-propen-1-yl)-1,3-benzodioxole (apiol)

Phase change data

Data compiled as indicated in comments:
TRC - Thermodynamics Research Center, NIST Boulder Laboratories, Chris Muzny director
AC - William E. Acree, Jr., James S. Chickos
Quantity | Value | Units | Method | Reference | Comment |
---|---|---|---|---|---|
Tfus | 302.4 | K | N/A | Tammann, 1899 | Uncertainty assigned by TRC = 0.05 K; TRC |
Enthalpy of vaporization
ΔvapH (kJ/mol) | Temperature (K) | Method | Reference | Comment |
---|---|---|---|---|
70.6 | 404. | A | Stephenson and Malanowski, 1987 | Based on data from 389. to 558. K.; AC |

Kovats' RI, non-polar column, temperature ramp

Data compiled by: NIST Mass Spectrometry Data Center, William E. Wallace, director

Column type CapillaryCapillary
Active phase HP-5MSDB-5
Column length (m) 30.30.
Carrier gas HeHe
Substrate
Column diameter (mm) 0.320.25
Phase thickness (μm) 0.250.25
Tstart (C) 70.60.
Tend (C) 250.240.
Heat rate (K/min) 3.4.
Initial hold (min) 5.
Final hold (min)
I 1674.1685.
ReferenceSiani, Ramos, et al., 1999da Silva, Zoghbi, et al., 1999
Comment MSDC-RI MSDC-RI

References

Tammann, 1899
Tammann, G.,
Z. Phys. Chem., Stoechiom. Verwandtschaftsl., 1899, 29, 51. [all data]
Stephenson and Malanowski, 1987
Stephenson, Richard M.; Malanowski, Stanislaw,
Handbook of the Thermodynamics of Organic Compounds, 1987, https://doi.org/10.1007/978-94-009-3173-2
. [all data]