o-Allyl oo-tert-butylsuccinate
- Formula: C11H18O5
- Molecular weight: 230.2576
- IUPAC Standard InChIKey: QPPROZHNOJODIC-UHFFFAOYSA-N
- CAS Registry Number: 52345-52-5
- Chemical structure:
View 3d structure (requires JavaScript / HTML 5) - Permanent link for this species. Use this link for bookmarking this species for future reference.

Condensed phase thermochemistry data

Data compiled by: Hussein Y. Afeefy, Joel F. Liebman, and Stephen E. Stein
Quantity | Value | Units | Method | Reference | Comment |
---|---|---|---|---|---|
ΔfH°liquid | -817. ± 4. | kJ/mol | Ccb | Zaikin, 1977 |

References

Zaikin, 1977
Zaikin, I.D.,
The dissociation energy of the peroxide linkage in peresters,
Russ. J. Phys. Chem. (Engl. Transl.), 1977, 51, 786-788. [all data]