Cyclopentene, 1-octyl-
- Formula: C13H24
- Molecular weight: 180.3297
- IUPAC Standard InChIKey: HUTUSVKGTVCLRO-UHFFFAOYSA-N
- CAS Registry Number: 52315-44-3
- Chemical structure:
View 3d structure (requires JavaScript / HTML 5) - Permanent link for this species. Use this link for bookmarking this species for future reference.

Phase change data

Data compiled by: Thermodynamics Research Center, NIST Boulder Laboratories, Chris Muzny director
Quantity | Value | Units | Method | Reference | Comment |
---|---|---|---|---|---|
Tfus | 236.7 | K | N/A | Schmidt, 1942 | Uncertainty assigned by TRC = 0.5 K |

Normal alkane RI, non-polar column, custom temperature program

Column type | Active phase | I | Reference | Comment |
---|---|---|---|---|
Capillary | Squalane | 1328. | Chen, 2008 | Program: not specified |

References

Schmidt, 1942
Schmidt, A.W.,
Physical properties of aliphatic compounds,
Ber. Dtsch. Chem. Ges. B, 1942, 75, 1399. [all data]