Pt[(OOC)2CHOH](NH3)2
- Formula: C3H8N2O5Pt
- Molecular weight: 347.190
- CAS Registry Number: 52260-82-9

Condensed phase thermochemistry data

Data compiled by: José A. Martinho Simões
Quantity | Value | Units | Method | Reference | Comment |
---|---|---|---|---|---|
ΔfH°solid | -287.31 ± 0.79 | kcal/mol | Review | Martinho Simões | The enthalpy of formation relies on -111.7 ± 0.72 kcal/mol for the enthalpy of formation of cis-Pt(Cl)2(NH3)2(cr). |

Phase change data

Data compiled by: José A. Martinho Simões
Quantity | Value | Units | Method | Reference | Comment |
---|---|---|---|---|---|
ΔsubH° | 76.5 ± 4.8 | kcal/mol | RSC | Mortimer, 1984 |

References

Martinho Simões
Martinho Simões, J.A.,
Private communication (see http://webbook.nist.gov/chemistry/om/). [all data]
Mortimer, 1984
Mortimer, C.T.,
Rev. Inorg. Chem., 1984, 6, 233. [all data]