trans-2,2,7,7-Tetramethyl-4-octene

Reaction thermochemistry data

Data compiled by: Hussein Y. Afeefy, Joel F. Liebman, and Stephen E. Stein

Individual Reactions

Hydrogen + trans-2,2,7,7-Tetramethyl-4-octene = 2,2,7,7-Tetramethyloctane

By formula: H2 + C12H24 = C12H26

Quantity Value Units Method Reference Comment
Δr-109.0 ± 0.63kJ/molChydTurner, Jarrett, et al., 1973liquid phase; solvent: Acetic acid

References

Turner, Jarrett, et al., 1973
Turner, R.B.; Jarrett, A.D.; Goebel, P.; Mallon, B.J., Heats of hydrogenation. 9. Cyclic acetylenes and some miscellaneous olefins, J. Am. Chem. Soc., 1973, 95, 790-792. [all data]