(Z)-3,5-Hexadien-1-yne
- Formula: C6H6
- Molecular weight: 78.1118
- IUPAC Standard InChIKey: OGWJYLKDZYZYBA-WAYWQWQTSA-N
- CAS Registry Number: 5222-76-4
- Chemical structure:
View 3d structure (requires JavaScript / HTML 5) - Stereoisomers:

Reaction thermochemistry data

Data compiled by: Hussein Y. Afeefy, Joel F. Liebman, and Stephen E. Stein
Individual Reactions
By formula: 4H2 + C6H6 = C6H14
Quantity | Value | Units | Method | Reference | Comment |
---|---|---|---|---|---|
ΔrH° | -522. ± 2. | kJ/mol | Chyd | Roth, Hopf, et al., 1994 | liquid phase; solvent: Isooctane |
By formula: C6H6 = C6H6
Quantity | Value | Units | Method | Reference | Comment |
---|---|---|---|---|---|
ΔrH° | 2. ± 3. | kJ/mol | Eqk | Roth, Hopf, et al., 1994 | gas phase; At 623 K |

References

Roth, Hopf, et al., 1994
Roth, W.R.; Hopf, H.; Horn, C.,
Propargyl-Stabilisierungsenergie,
Chem. Ber., 1994, 127, 1781-1795. [all data]