Benzeneacetic acid, α-hydroxy-α-phenyl-, ethyl ester
- Formula: C16H16O3
- Molecular weight: 256.2964
- IUPAC Standard InChIKey: AIPVNQQMYPWQSX-UHFFFAOYSA-N
- CAS Registry Number: 52182-15-7
- Chemical structure:

Phase change data

Data compiled by: Robert L. Brown and Stephen E. Stein
Quantity | Value | Units | Method | Reference | Comment |
---|---|---|---|---|---|
Tfus | 307. | K | N/A | Buckingham and Donaghy, 1982 |
Reduced pressure boiling point
Tboil (K) | Pressure (atm) | Reference |
---|---|---|
474.2 | 0.028 | Weast and Grasselli, 1989 |
474. | 0.028 | Buckingham and Donaghy, 1982 |

References

Buckingham and Donaghy, 1982
Buckingham, J.; Donaghy, S.M.,
Dictionary of Organic Compounds: Fifth Edition, Chapman and Hall, New York, 1982, 1. [all data]
Weast and Grasselli, 1989
CRC Handbook of Data on Organic Compounds, 2nd Editon, Weast,R.C and Grasselli, J.G., ed(s)., CRC Press, Inc., Boca Raton, FL, 1989, 1. [all data]