Butane, 2-iodo-, (.+/-.)-
- Formula: C4H9I
- Molecular weight: 184.0187
- IUPAC Standard InChIKey: IQRUSQUYPCHEKN-UHFFFAOYSA-N
- CAS Registry Number: 52152-71-3
- Chemical structure:
View 3d structure (requires JavaScript / HTML 5) - Species with the same structure:

Phase change data

Data compiled by: Robert L. Brown and Stephen E. Stein
Quantity | Value | Units | Method | Reference | Comment |
---|---|---|---|---|---|
Tboil | 393.2 | K | N/A | Weast and Grasselli, 1989 |
Reduced pressure boiling point
Tboil (K) | Pressure (bar) | Reference |
---|---|---|
306.2 | 0.060 | Weast and Grasselli, 1989 |

References

Weast and Grasselli, 1989
CRC Handbook of Data on Organic Compounds, 2nd Editon, Weast,R.C and Grasselli, J.G., ed(s)., CRC Press, Inc., Boca Raton, FL, 1989, 1. [all data]