Methandriol
- Formula: C20H32O2
- Molecular weight: 304.4669
- IUPAC Standard InChIKey: WRWBCPJQPDHXTJ-OBMPVAGPSA-N
- CAS Registry Number: 521-10-8
- Chemical structure:
- Other names: 17α-Methyl-5-androsten-3β,17β-diol; 17-α-Methyl-5-androstene-3-β,17-β-diol; Androst-5-ene-3,17-diol, 17-methyl-, (3β,17β)-; Androdiol; Androst-5-ene-3β,17β-diol, 17-methyl-; Androteston-M; Androtestone-M; Cenabolic; Crestabolic; Diolandrone; Diolostene; Esjaydiol; Hibol; Madiol; Masdiol; Megabion; Mestenediol; Metandiol; Metandriol; Metendiol; Methanabol; Methandiol; Methandrioldiol; Methandrolan; Methostan; Methylandrostendiol; Methylandrostenediol; Metidione; Metildiolo; Metocryst; MAD; Nabadial; Neostene; Neosteron; Neutrormone; Neutrosteron; Notandron; Notandron-depot; Protandren; Stenediol; Stenibel; Stenosterone; Testodiol; Troformone; Androst-5-ene-3,17-diol, 17-methyl-, (β,β,α)-; Stenibell; 17α-Methylandrost-5-ene-3β,17β-diol; 17α-Methylandrost-5-ene-3,17-diol-, (3β,17β)-; 17-Methylandrost-5-ene-3β,17β-diol; NSC 22366; 17α-Methyl-δ5-androsten-3β,17β-diol; Androst-5-ene-3,17-diol, 17-methyl-,; 17-Methylandrost-5-ene-3,17-diol

Van Den Dool and Kratz RI, non-polar column, custom temperature program

Column type | Active phase | I | Reference | Comment |
---|---|---|---|---|
Capillary | VF-5MS | 2634.2 | Tret'yakov, 2008 | 30. m/0.25 mm/0.25 μm, He; Program: Multi-step temperature program; T(initial)=60C; T(final)=270C |

Normal alkane RI, non-polar column, temperature ramp

Column type | Active phase | I | Reference | Comment |
---|---|---|---|---|
Capillary | SE-54 | 2570. | Schänzer, Opfermann, et al., 1992 | 5. K/min; Column length: 17. m; Phase thickness: 0.33 μm; Tstart: 200. C; Tend: 320. C |

References

Tret'yakov, 2008
Tret'yakov, K.V.,
Retention Data. NIST Mass Spectrometry Data Center., NIST Mass Spectrometry Data Center, 2008. [all data]
Schänzer, Opfermann, et al., 1992
Schänzer, W.; Opfermann, G.; Donike, M.,
17-Epimerization of 17α-methyl anabolic steroids in humans: metabolism and synthesis of 17α-hydroxy-17β-methyl steroids,
Steroids, 1992, 57, 11, 537-550, https://doi.org/10.1016/0039-128X(92)90023-3
. [all data]