(-)-β-Bourbonene
- Formula: C15H24
- Molecular weight: 204.3511
- IUPAC Standard InChIKey: YIRAHEODBQONHI-XTLGRWLVSA-N
- CAS Registry Number: 5208-59-3
- Chemical structure:
View 3d structure (requires JavaScript / HTML 5) - Stereoisomers:
- Other names: Cyclobuta[1,2:3,4]dicyclopentene, decahydro-3a-methyl-6-methylene-1-(1-methylethyl)-, [1S-(1α,3aα,3bβ,6aβ,6bα)]-; β-Bourbonene; Cyclobuta[1,2:3,4]dicyclopentene, 1,2,3,3a,3bβ,4,5,6,6aβ,6bα-decahydro-1α-isopropyl-3aα-methyl-6-methylene-; Cyclobuta[1,2:3,4]dicyclopentene, decahydro-3a-methyl-6-methylene-1-(1-methylethyl)-, (1α,3aα,3bβ,6aβ,6bα)-; [1S-[1α,3aα,3bβ,6aβ,6bα]]-Cyclobuta[1,2:3,4]dicyclopentene-decahydro-3a-methyl-6-methylene-1-[1-methylethyl]; (1S,3aS,3bR,6aS,6bR)-1-Isopropyl-3a-methyl-6-methylenedecahydrocyclobuta[1,2:3,4]di[5]annulene; β-bourbenene; Cyclobuta[1,2:3,4]dicyclopentene, decahydro-3a-methyl-6-methylene-1-(1-methylethyl)-, (1S,3aS,3bR,6aS,6bR)-; beta-bourbonene

Kovats' RI, non-polar column, isothermal

Column type | Active phase | Temperature (C) | I | Reference | Comment |
---|---|---|---|---|---|
Packed | SF-96 | 170. | 1411.7 | Andersen, Bissonette, et al., 1977 | Column length: 7.3 m |
Packed | SE-30 | 130. | 1386. | Andersen and Falcone, 1969 | He, Chromosorb G |

Kovats' RI, non-polar column, temperature ramp

Column type | Active phase | I | Reference | Comment |
---|---|---|---|---|
Capillary | HP-5MS | 1384. | Hazzit, Baaliouamer, et al., 2006 | 30. m/0.25 mm/0.25 μm, He, 60. C @ 8. min, 2. K/min, 280. C @ 30. min |
Capillary | HP-5MS | 1406. | Jalali-Heravi, Zekavat, et al., 2006 | 60. m/0.25 mm/0.25 μm, He, 40. C @ 1. min, 3. K/min, 250. C @ 20. min |
Capillary | DB-5 | 1385. | Lucero, Fredrickson, et al., 2006 | 30. m/0.25 mm/0.25 μm, He, 3. K/min; Tstart: 60. C |
Capillary | HP-1 | 1391. | Meccia G., Rosquete C., et al., 2006 | 60. m/0.25 mm/0.25 μm, He, 60. C @ 5. min, 4. K/min, 200. C @ 25. min |
Capillary | DB-1 | 1393. | Mevy, Bessiere, et al., 2006 | He, 60. C @ 3. min, 3. K/min; Column length: 25. m; Column diameter: 0.2 mm; Tend: 220. C |
Capillary | DB-5 | 1382. | Sylvestre, Pichette, et al., 2006 | 30. m/0.25 mm/0.25 μm, 40. C @ 2. min, 2. K/min, 210. C @ 33. min |
Capillary | DB-5 | 1388. | Adams, Morris, et al., 2005 | 30. m/0.26 mm/0.25 μm, He, 3. K/min; Tstart: 60. C; Tend: 246. C |
Capillary | DB-5 | 1384. | Adams and Nguyen, 2005 | 30. m/0.26 mm/0.25 μm, He, 3. K/min; Tstart: 60. C; Tend: 246. C |
Capillary | HP-5MS | 1386. | Asuming, Beauchamp, et al., 2005 | 30. m/0.25 mm/0.25 μm, He, 50. C @ 10. min, 3. K/min, 250. C @ 5. min |
Capillary | HP-5MS | 1412. | Tepe, Sokmen, et al., 2005 | 30. m/0.25 mm/0.25 μm, He, 3. K/min; Tstart: 50. C; Tend: 240. C |
Capillary | SPB-5 | 1401. | Gauvin, Lecomte, et al., 2004 | 60. m/0.32 mm/1. μm, He, 4. K/min, 200. C @ 30. min; Tstart: 60. C |
Capillary | HP-5MS | 1382. | Juliani, Zygadlo, et al., 2004 | 30. m/0.25 mm/0.25 μm, He, 60. C @ 1. min, 4. K/min, 200. C @ 15. min |
Capillary | HP-5 | 1386. | Lopes, Strobl, et al., 2004 | 30. m/0.25 mm/0.25 μm, He, 3. K/min; Tstart: 60. C; Tend: 260. C |
Capillary | DB-5 | 1384. | Morteza-Semnani, Azadbakht, et al., 2004 | 30. m/0.25 mm/0.25 μm, He, 60. C @ 4. min, 4. K/min; Tend: 220. C |
Capillary | DB-5MS | 1384. | Palmeira, Moura, et al., 2004 | 30. m/0.25 mm/0.25 μm, He, 3. K/min; Tstart: 60. C; Tend: 240. C |
Capillary | DB-5 | 1375. | Santos, Lopes, et al., 2004 | 30. m/0.25 mm/0.25 μm, He, 5. K/min; Tstart: 60. C; Tend: 300. C |
Capillary | CP Sil 8 CB | 1396. | Schwob, Bessiere, et al., 2004 | 30. m/0.25 mm/0.25 μm, H2, 50. C @ 2. min, 3. K/min; Tend: 220. C |
Capillary | HP-5MS | 1375. | Siani, Garrido, et al., 2004 | 30. m/0.32 mm/0.25 μm, He, 70. C @ 5. min, 3. K/min; Tend: 250. C |
Capillary | DB-1 | 1383. | Velasco-Negueruela, Sanz, et al., 2004 | 50. m/0.25 mm/0.25 μm, N2, 4. K/min; Tstart: 95. C; Tend: 240. C |
Capillary | DB-5 | 1380. | Amparo Blázquez, Pérez, et al., 2003 | He, 40. C @ 5. min, 3. K/min, 280. C @ 5. min; Column length: 25. m; Column diameter: 0.25 mm |
Capillary | HP-5MS | 1391. | Baranauskiene, Venskutonis, et al., 2003 | 30. m/0.25 mm/0.25 μm, He, 50. C @ 2. min, 4. K/min, 280. C @ 10. min |
Capillary | DB-5 | 1384. | Lucero, Estell, et al., 2003 | 30. m/0.25 mm/0.25 μm, He, 3. K/min; Tstart: 60. C |
Capillary | HP-5 | 1374. | Özcan, Tzakou, et al., 2003 | 30. m/0.25 mm/0.25 μm, He, 3. K/min; Tstart: 60. C; Tend: 280. C |
Capillary | DB-5 | 1407. | Buchin, Salmon, et al., 2002 | 60. m/0.32 mm/1. μm, He, 40. C @ 5. min, 3. K/min, 230. C @ 2. min |
Capillary | SE-30 | 1382. | Palá-Paúl, Velasco-Negueruela, et al., 2002 | 25. m/0.22 mm/0.25 μm, He, 4. K/min; Tstart: 70. C; Tend: 220. C |
Capillary | Cross-Linked Methylsilicone | 1384. | Rajeswara Rao, Kaul, et al., 2002 | 50. m/0.2 mm/0.25 μm, He, 4. K/min; Tstart: 100. C; Tend: 280. C |
Capillary | HP-5MS | 1384. | Salido, Altarejos, et al., 2002 | 30. m/0.25 mm/0.25 μm, He, 3. K/min; Tstart: 50. C; Tend: 250. C |
Capillary | PTE-5 | 1386. | Gudzic, Dordevic, et al., 2001 | 60. m/0.32 mm/0.39 μm, H2, 4.3 K/min; Tstart: 60. C; Tend: 285. C |
Capillary | PTE-5 | 1387. | Gudzic, Dordevic, et al., 2001 | 60. m/0.32 mm/0.39 μm, H2, 4.3 K/min; Tstart: 60. C; Tend: 285. C |
Capillary | BP-1 | 1386. | Jain, Aggarwal, et al., 2001 | 25. m/0.55 mm/0.25 μm, N2, 5. K/min, 220. C @ 15. min; Tstart: 60. C |
Capillary | HP-5 | 1384. | Kitic, Palic, et al., 2001 | 25. m/0.32 mm/0.52 μm, H2, 4. K/min; Tstart: 40. C; Tend: 240. C |
Capillary | HP-5 | 1383. | Tzakou and Couladis, 2001 | 30. m/0.25 mm/0.25 μm, He, 3. K/min; Tstart: 60. C; Tend: 280. C |
Capillary | DB-5 | 1384. | Adams, 2000 | 30. m/0.26 mm/0.25 μm, He, 3. K/min; Tstart: 60. C; Tend: 240. C |
Capillary | DB-5 | 1384. | Adams, 2000, 2 | 30. m/0.26 mm/0.25 μm, He, 3. K/min; Tstart: 60. C; Tend: 246. C |
Capillary | SE-30 | 1380. | Kardali, Velasco-Negueruela, et al., 2000 | 25. m/0.22 mm/0.25 μm, He, 5. K/min; Tstart: 70. C; Tend: 220. C |
Capillary | BP-1 | 1386. | Rao, Kaul, et al., 2000 | N2, 5. K/min, 220. C @ 10. min; Column length: 25. m; Column diameter: 0.5 mm; Tstart: 60. C |
Capillary | DB-5 | 1384. | Rao, Rout, et al., 2000 | He, 2. K/min; Column length: 30. m; Column diameter: 0.25 mm; Tstart: 60. C; Tend: 180. C |
Capillary | BP-1 | 1386. | Rao, Sastry, et al., 2000 | 25. m/0.50 mm/0.25 μm, N2, 5. K/min, 220. C @ 10. min; Tstart: 60. C |
Capillary | DB-5 | 1390. | Tzakou, Harvala, et al., 2000 | 50. C @ 5. min, 3. K/min; Column length: 30. m; Column diameter: 0.32 mm; Tend: 250. C |
Capillary | DB-5 | 1383. | Adams, 1999 | 30. m/0.26 mm/0.25 μm, He, 3. K/min; Tstart: 60. C; Tend: 246. C |
Capillary | HP-5MS | 1377. | Siani, Ramos, et al., 1999 | 30. m/0.32 mm/0.25 μm, He, 70. C @ 5. min, 3. K/min; Tend: 250. C |
Capillary | DB-5 | 1384. | da Silva, Andrade, et al., 1999 | 30. m/0.25 mm/0.25 μm, He, 3. K/min; Tstart: 60. C; Tend: 240. C |
Capillary | DB-5 | 1383. | da Silva, Zoghbi, et al., 1999 | 30. m/0.25 mm/0.25 μm, He, 4. K/min; Tstart: 60. C; Tend: 240. C |
Capillary | CP Sil 5 CB | 1386. | Kaul and Vats, 1998 | 5. K/min; Column length: 25. m; Column diameter: 0.25 mm; Tstart: 60. C; Tend: 280. C |
Capillary | BP-1 | 1387. | Kulkarni, Mallavarapu, et al., 1998 | N2, 5. K/min; Column length: 25. m; Column diameter: 0.25 mm; Tstart: 60. C; Tend: 220. C |
Capillary | DB-5 | 1346. | Senatore, Urrunaga Soria, et al., 1998 | 30. m/0.25 mm/0.25 μm, He, 40. C @ 5. min, 2. K/min, 250. C @ 20. min |
Capillary | DB-5 | 1346. | Senatore, 1998 | 30. m/0.25 mm/0.25 μm, He, 40. C @ 5. min, 2. K/min, 250. C @ 20. min |
Capillary | DB-5 | 1386. | Zoghbi, Andrade, et al., 1998 | 30. m/0.25 mm/0.25 μm, He, 4. K/min; Tstart: 60. C; Tend: 240. C |
Capillary | DB-5 | 1347. | Senatore, Urrunaga Soria, et al., 1997 | 30. m/0.25 mm/0.25 μm, He, 40. C @ 5. min, 2. K/min, 250. C @ 20. min |
Capillary | DB-1 | 1383. | Saad, El-Sharkawy, et al., 1995 | 28. m/0.25 mm/0.25 μm, He, 50. C @ 1. min, 4. K/min; Tend: 270. C |

Kovats' RI, non-polar column, custom temperature program

Column type | Active phase | I | Reference | Comment |
---|---|---|---|---|
Capillary | HP-5 | 1384. | Shellie and Marriott, 2003 | 30. m/0.25 mm/0.25 μm, He; Program: not specified |
Capillary | HP-5 | 1383. | Frizzo, Serafini, et al., 2001 | 30. m/0.32 mm/0.25 μm, H2; Program: 60 0C (8 min) 3 K/min -> 180 0C 20 K/min (20 min) |
Capillary | DB-5 | 1385. | Rao, Rout, et al., 2000 | He; Column length: 30. m; Column diameter: 0.25 mm; Program: not specified |
Capillary | DB-5 | 1384. | Adams, 1998 | 30. m/0.26 mm/0.25 μm; Program: not specified |
Capillary | SF-96 | 1407. | Malingré and Maarse, 1974 | Column length: 150. m; Column diameter: 0.75 mm; Program: not specified |

Kovats' RI, polar column, isothermal

Column type | Active phase | Temperature (C) | I | Reference | Comment |
---|---|---|---|---|---|
Packed | Carbowax 20M | 150. | 1577. | Andersen, Bissonette, et al., 1977 | Column length: 7.3 m |
Capillary | Carbowax 20M | 130. | 1544. | Malingré and Maarse, 1974 | Column length: 150. m; Column diameter: 0.75 mm |
Packed | Carbowax 20M | 132. | 1547. | Andersen and Falcone, 1969 |

Kovats' RI, polar column, temperature ramp

Column type | Active phase | I | Reference | Comment |
---|---|---|---|---|
Capillary | Stabilwax | 1536. | Hazzit, Baaliouamer, et al., 2006 | 30. m/0.32 mm/1. μm, N2, 50. C @ 3. min, 2. K/min, 220. C @ 15. min |
Capillary | Supelcowax-10 | 1521. | Sylvestre, Pichette, et al., 2006 | 30. m/0.25 mm/0.25 μm, 40. C @ 2. min, 2. K/min, 210. C @ 33. min |
Capillary | HP-Wax | 1542. | Gauvin, Lecomte, et al., 2004 | 50. m/0.2 mm/0.4 μm, He, 4. K/min, 230. C @ 30. min; Tstart: 60. C |
Capillary | DB-Wax | 1500. | Lopes, Strobl, et al., 2004 | 30. m/0.32 mm/0.25 μm, He, 40. C @ 5. min, 3. K/min; Tend: 220. C |
Capillary | Supelcowax-10 | 1546. | Tzakou and Couladis, 2001 | 30. m/0.32 mm/0.25 μm, He, 3. K/min; Tstart: 75. C; Tend: 230. C |
Capillary | Carbowax 20M | 1495. | Kulkarni, Mallavarapu, et al., 1998 | N2, 5. K/min; Column length: 25. m; Column diameter: 0.25 mm; Tstart: 60. C; Tend: 200. C |
Capillary | Supelcowax-10 | 1519. | Loayza, Abujder, et al., 1995 | 40. C @ 2. min, 2. K/min, 210. C @ 120. min; Column length: 30. m |
Capillary | Supelcowax-10 | 1531. | Loayza, Abujder, et al., 1995 | 40. C @ 2. min, 2. K/min, 210. C @ 120. min; Column length: 30. m |

Kovats' RI, polar column, custom temperature program

Column type | Active phase | I | Reference | Comment |
---|---|---|---|---|
Capillary | HP-Innowax | 1526. | Frizzo, Serafini, et al., 2001 | 30. m/0.32 mm/0.50 μm, H2; Program: 60 0C (8 min) 3 K/min -> 180 0C 20 K/min -> 230 0C (20 min) |

Van Den Dool and Kratz RI, non-polar column, temperature ramp

Column type | Active phase | I | Reference | Comment |
---|---|---|---|---|
Capillary | HP-5 | 1387. | Benzo, Gilardoni, et al., 2007 | 30. m/0.25 mm/0.25 μm, He, 40. C @ 1. min, 5. K/min, 250. C @ 10. min |
Capillary | CP-Sil PONA GB | 1408. | Cunicao, Lopes, et al., 2007 | 100. m/0.25 mm/0.25 μm, He, 140. C @ 10. min, 5. K/min, 230. C @ 25. min |
Capillary | HP-5 | 1391. | Dehghan, Solaimanian, et al., 2007 | 25. m/0.25 mm/0.25 μm, He, 60. C @ 2. min, 4. K/min; Tend: 240. C |
Capillary | DB-5 | 1385. | Flamini, Cioni, et al., 2007 | 30. m/0.25 mm/0.25 μm, He, 3. K/min; Tstart: 60. C; Tend: 240. C |
Capillary | BP-1 | 1386. | Lesueur, de Rocca Serra, et al., 2007 | 50. m/0.22 mm/0.25 μm, He, 2. K/min, 220. C @ 20. min; Tstart: 60. C |
Capillary | DB-5 | 1384. | Maccioni, Baldini, et al., 2007 | 30. m/0.25 mm/0.25 μm, He, 3. K/min; Tstart: 60. C; Tend: 240. C |
Capillary | DB-5 | 1384. | Maccioni, Baldini, et al., 2007 | 30. m/0.25 mm/0.25 μm, He, 3. K/min; Tstart: 60. C; Tend: 240. C |
Capillary | DB-5 | 1386. | Martins, Santos, et al., 2007 | 30. m/0.22 mm/0.25 μm, 60. C @ 2. min, 3. K/min; Tend: 240. C |
Capillary | RTX-1 | 1388. | Paolini J., Costa J., et al., 2007 | 60. m/0.22 mm/0.25 μm, He, 2. K/min, 230. C @ 35. min; Tstart: 60. C |
Capillary | HP-101 | 1354. | Politeo, Jukic, et al., 2007 | 25. m/0.2 mm/0.2 μm, He, 70. C @ 2. min, 3. K/min, 200. C @ 15. min |
Capillary | SPB-1 | 1374. | Radulovic, Lazarevic, et al., 2007 | 30. m/0.25 mm/0.25 μm, He, 50. C @ 3. min, 5. K/min, 250. C @ 15. min |
Capillary | HP-5MS | 1382. | Radulovic, Lazarevic, et al., 2007 | 30. m/0.25 mm/0.25 μm, He, 60. C @ 5. min, 4. K/min; Tend: 280. C |
Capillary | HP-5MS | 1382. | Saroglou, Marin, et al., 2007 | 30. m/0.25 mm/0.25 μm, He, 60. C @ 5. min, 4. K/min; Tend: 280. C |
Capillary | DB-1 | 1392. | Sonboli, Azizian, et al., 2007 | 60. m/0.25 mm/0.25 μm, N2, 5. K/min, 250. C @ 10. min; Tstart: 60. C |
Capillary | DB-5 | 1384. | Telascrea, de Araujo, et al., 2007 | 30. m/0.25 mm/0.25 μm, He, 3. K/min; Tstart: 60. C; Tend: 240. C |
Capillary | HP-5MS | 1381. | Vagionas, Ngassapa, et al., 2007 | 30. m/0.25 mm/0.25 μm, He, 3. K/min; Tstart: 60. C; Tend: 280. C |
Capillary | HP-5MS | 1361. | Basta, Tzakou, et al., 2006 | 30. m/0.25 mm/0.25 μm, He, 3. K/min; Tstart: 60. C; Tend: 280. C |
Capillary | SPB-1 | 1374. | Blagojevic, Radulovic, et al., 2006 | 30. m/0.25 mm/0.25 μm, He, 50. C @ 3. min, 5. K/min, 250. C @ 15. min |
Capillary | DB-5 | 1384. | Blagojevic, Radulovic, et al., 2006 | 30. m/0.2 mm/0.25 μm, He, 50. C @ 3. min, 5. K/min, 250. C @ 15. min |
Capillary | DB-5 | 1384. | Block, Flamini, et al., 2006 | 30. m/0.25 mm/0.25 μm, He, 3. K/min; Tstart: 60. C; Tend: 240. C |
Capillary | HP-5MS | 1380. | Chorianopoulos N., Evergets E., et al., 2006 | 30. m/0.25 mm/0.25 μm, He, 3. K/min; Tstart: 60. C; Tend: 280. C |
Capillary | DB-5 | 1384. | Dob, Dahmane, et al., 2006 | 30. m/0.32 mm/0.25 μm, N2, 60. C @ 3. min, 3. K/min, 240. C @ 5. min |
Capillary | HP-5 | 1385. | Flamini, Tebano, et al., 2006 | 30. m/0.25 mm/0.25 μm, N2, 60. C @ 10. min, 5. K/min; Tend: 220. C |
Capillary | HP-5 | 1388. | Javidnia, Miri, et al., 2006 | 30. m/0.25 mm/0.25 μm, He, 3. K/min; Tstart: 60. C; Tend: 260. C |
Capillary | DB-1 | 1383. | Kuiate, Bessière, et al., 2006 | 30. m/0.25 mm/0.25 μm, N2, 4. K/min; Tstart: 50. C; Tend: 220. C |
Capillary | HP-5MS | 1387. | Kukic J., Petrovic S., et al., 2006 | 30. m/0.25 mm/0.25 μm, He, 3. K/min; Tstart: 60. C; Tend: 280. C |
Capillary | DB-5 | 1384. | Masoudi, Esmaeili, et al., 2006 | 50. m/0.2 mm/0.32 μm, N2, 60. C @ 3. min, 5. K/min, 220. C @ 5. min |
Capillary | HP-5MS | 1358. | Pavlovic, Kovacevic, et al., 2006 | 30. m/0.25 mm/0.25 μm, He, 3. K/min; Tstart: 60. C; Tend: 280. C |
Capillary | DB-5 | 1375. | Pavlovic, Tzakou, et al., 2006 | 30. m/0.32 mm/0.25 μm, He, 3. K/min; Tstart: 60. C; Tend: 280. C |
Capillary | SPB-1 | 1376. | Pinto, Pina-Vaz, et al., 2006 | 30. m/0.2 mm/0.2 μm, He, 3. K/min, 220. C @ 15. min; Tstart: 70. C |
Capillary | SPB-1 | 1374. | Radulovic, Lazarevic, et al., 2006 | 30. m/0.25 mm/0.25 μm, He, 50. C @ 3. min, 5. K/min, 250. C @ 15. min |
Capillary | SPB-1 | 1375. | Radulovic, Mananjarasoa, et al., 2006 | 30. m/0.25 mm/0.25 μm, He, 50. C @ 3. min, 5. K/min, 250. C @ 15. min |
Capillary | SPB-1 | 1376. | Salgueiro L.R., Pinto E., et al., 2006 | 30. m/0.2 mm/0.2 μm, He, 3. K/min, 220. C @ 15. min; Tstart: 70. C |
Capillary | HP-5MS | 1381. | Saroglou, Dorizas, et al., 2006 | 30. m/0.25 mm/0.25 μm, He, 60. C @ 5. min, 4. K/min; Tend: 280. C |
Capillary | HP-5MS | 1380. | Silva-Brandão, Solferini, et al., 2006 | 30. m/0.25 mm/0.25 μm, He, 3. K/min; Tstart: 60. C; Tend: 300. C |
Capillary | DB-5 | 1388. | Su, Ho, et al., 2006 | 30. m/0.25 mm/0.25 μm, He, 50. C @ 2. min, 5. K/min; Tend: 250. C |
Capillary | HP-5MS | 1378. | Vujisic L., Vuckovic I., et al., 2006 | 30. m/0.25 mm/0.25 μm, H2, 4.3 K/min; Tstart: 50. C; Tend: 285. C |
Capillary | HP-5 | 1382. | Vundac, Pfeifhofer, et al., 2006 | 30. m/0.25 mm/0.25 μm, He, 40. C @ 5. min, 4. K/min; Tend: 300. C |
Capillary | SPB-1 | 1376. | Boskovic, Radulovic, et al., 2005 | 30. m/0.25 mm/0.25 μm, He, 50. C @ 3. min, 5. K/min, 250. C @ 15. min |
Capillary | DB-5 | 1386. | Boskovic, Radulovic, et al., 2005 | 30. m/0.2 mm/0.25 μm, He, 50. C @ 3. min, 5. K/min, 250. C @ 15. min |
Capillary | SE-54 | 1388. | Brantner, Pfeifhofer, et al., 2005 | 50. m/0.25 mm/0.27 μm, H2, 5. K/min; Tstart: 50. C; Tend: 300. C |
Capillary | HP-5 | 1384. | Celik, Gokturk, et al., 2005 | 30. m/0.25 mm/0.25 μm, N2, 60. C @ 10. min, 5. K/min; Tend: 220. C |
Capillary | DB-1 | 1376. | Dob, Berramdane, et al., 2005 | 30. m/0.32 mm/0.25 μm, N2, 50. C @ 3. min, 2. K/min, 260. C @ 5. min |
Capillary | DB-1 | 1376. | Dob, Dahmane, et al., 2005 | 30. m/0.32 mm/0.25 μm, 50. C @ 8. min, 2. K/min; Tend: 250. C |
Capillary | DB-1 | 1362. | Fanciullino, Gancel, et al., 2005 | 30. m/0.25 mm/0.25 μm, He, 3. K/min, 250. C @ 20. min; Tstart: 40. C |
Capillary | HP-5 | 1384. | Flamini, Luigi Cioni, et al., 2005 | 30. m/0.25 mm/0.25 μm, N2, 60. C @ 10. min, 5. K/min; Tend: 220. C |
Capillary | HP-5 | 1386. | Flamini, Luigi Cioni, et al., 2005, 2 | 30. m/0.25 mm/0.25 μm, N2, 60. C @ 10. min, 5. K/min; Tend: 220. C |
Capillary | DB-1 | 1362. | Gancel, Ollitrault, et al., 2005 | 30. m/0.25 mm/0.25 μm, He, 3. K/min, 250. C @ 20. min; Tstart: 40. C |
Capillary | CP Sil 5 CB | 1375. | Idzojtic, Kajba, et al., 2005 | 50. m/0.22 mm/0.13 μm, H2, 4. K/min, 300. C @ 10. min; Tstart: 40. C |
Capillary | DB-1 | 1377. | bin Jantan, Yalvema, et al., 2005 | 25. m/0.25 mm/0.25 μm, 60. C @ 10. min, 3. K/min, 180. C @ 10. min |
Capillary | HP-5 | 1384. | Javidnia, Miri, et al., 2005 | 30. m/0.25 mm/0.25 μm, He, 3. K/min; Tstart: 60. C; Tend: 260. C |
Capillary | HP-5 | 1384. | Javidnia, Miri, et al., 2005, 2 | He, 3. K/min; Column length: 30. m; Column diameter: 0.25 mm; Tstart: 60. C; Tend: 260. C |
Capillary | RTX-1 | 1388. | Paolini, Costa, et al., 2005 | 60. m/0.22 mm/0.25 μm, He, 2. K/min, 230. C @ 35. min; Tstart: 60. C |
Capillary | SE-54 | 1384. | Simionatto, Porto, et al., 2005 | 25. m/0.25 mm/0.2 μm, H2, 4. K/min; Tstart: 50. C; Tend: 250. C |
Capillary | DB-1 | 1386. | Tchoumbougnang, Zollo, et al., 2005 | 30. m/0.25 mm/0.25 μm, N2, 5. K/min; Tstart: 50. C; Tend: 200. C |
Capillary | BP-1 | 1385. | Vellutini, Baldovini, et al., 2005 | 50. m/0.22 mm/0.25 μm, He, 2. K/min, 230. C @ 35. min; Tstart: 60. C |
Capillary | HP-5MS | 1382.7 | Zhao, Liang, et al., 2005 | 30. m/0.25 mm/0.25 μm, He, 2. K/min; Tstart: 80. C; Tend: 290. C |
Capillary | HP-5MS | 1389. | Zhao, Liang, et al., 2005 | 30. m/0.25 mm/0.25 μm, He, 4. K/min; Tstart: 80. C; Tend: 290. C |
Capillary | HP-5MS | 1394.5 | Zhao, Liang, et al., 2005 | 30. m/0.25 mm/0.25 μm, He, 6. K/min; Tstart: 80. C; Tend: 290. C |
Capillary | HP-5MS | 1380. | Aligiannis, Kalpoutzakis, et al., 2004 | 30. m/0.25 mm/0.25 μm, He, 3. K/min; Tstart: 60. C; Tend: 280. C |
Capillary | SPB-1 | 1376. | Antunes, Sevinate-Pinto, et al., 2004 | 30. m/0.25 mm/0.25 μm, He, 3. K/min, 220. C @ 15. min; Tstart: 70. C |
Capillary | HP-5 | 1386. | Bertoli, Menichini, et al., 2004 | 30. m/0.25 mm/0.25 μm, N2, 60. C @ 10. min, 5. K/min; Tend: 220. C |
Capillary | SPB-1 | 1375. | Cavaleiro, Salgueiro, et al., 2004 | 30. m/0.2 mm/0.2 μm, He, 3. K/min, 220. C @ 15. min; Tstart: 70. C |
Capillary | HP-5 | 1385. | Ceccarini, Macchia, et al., 2004 | 30. m/0.25 mm/0.25 μm, 60. C @ 10. min, 5. K/min; Tend: 220. C |
Capillary | HP-5MS | 1380. | Chorianopoulos, Kalpoutzakis, et al., 2004 | 30. m/0.25 mm/0.25 μm, He, 3. K/min; Tstart: 60. C; Tend: 280. C |
Capillary | HP-5 | 1385. | Flamini, Bader, et al., 2004 | 30. m/0.25 mm/0.25 μm, He, 3. K/min; Tstart: 60. C; Tend: 240. C |
Capillary | DB-5 | 1383. | Flamini, Cioni, et al., 2004 | 30. m/0.25 mm/0.25 μm, N2, 3. K/min; Tstart: 60. C; Tend: 240. C |
Capillary | HP-5 | 1385. | Flamini, Luigi Cioni, et al., 2004 | 30. m/0.25 mm/0.25 μm, N2, 60. C @ 10. min, 5. K/min; Tend: 220. C |
Capillary | HP-5MS | 1387. | Grujic-Jovanovic, Skaltsa, et al., 2004 | 30. m/0.25 mm/0.25 μm, He, 60. C @ 5. min, 4. K/min; Tend: 280. C |
Capillary | HP-5 | 1382. | Isidorov, Krajewska, et al., 2004 | 30. m/0.25 mm/0.25 μm, He, 3. K/min; Tstart: 40. C; Tend: 250. C |
Capillary | HP-5 | 1383. | Javidnia, Miri, et al., 2004 | 30. m/0.25 mm/0.25 μm, He, 3. K/min; Tstart: 60. C; Tend: 260. C |
Capillary | HP-5 | 1384. | Javidnia, Miri, et al., 2004, 2 | He, 3. K/min; Column length: 30. m; Column diameter: 0.25 mm; Tstart: 60. C; Tend: 260. C |
Capillary | SPB-1 | 1376. | Moldão-Martins, Beirão-da-Costa, et al., 2004 | 30. m/0.2 mm/0.2 μm, He, 3. K/min, 220. C @ 15. min; Tstart: 70. C |
Capillary | SPB-1 | 1376. | Moldão-Martins, Beirão-da-Costa, et al., 2004 | 30. m/0.2 mm/0.2 μm, He, 3. K/min, 220. C @ 15. min; Tstart: 70. C |
Capillary | RSL-200 | 1397. | Ngassoum, Ousmaila, et al., 2004 | 30. m/0.32 mm/0.25 μm, H2, 40. C @ 5. min, 6. K/min, 280. C @ 5. min |
Capillary | Methyl Silicone | 1386. | Özcan and Chalchat, 2004 | He, 3. K/min; Column length: 50. m; Column diameter: 0.25 mm; Tstart: 50. C; Tend: 240. C |
Capillary | HP-5 | 1385. | Sartoratto, Machado, et al., 2004 | 25. m/0.2 mm/0.33 μm, He, 3. K/min, 240. C @ 7. min; Tstart: 60. C |
Capillary | HP-5 | 1384. | Stashenko, Jaramillo, et al., 2004 | 50. m/0.2 mm/0.2 μm, He, 35. C @ 15. min, 3. K/min, 250. C @ 40. min |
Capillary | HP-5MS | 1364. | Tzakou, Vagias, et al., 2004 | 30. m/0.25 mm/0.25 μm, He, 3. K/min; Tstart: 60. C; Tend: 280. C |
Capillary | DB-5MS | 1388. | Yu, Kim, et al., 2004 | 30. m/0.25 mm/0.25 μm, He, 40. C @ 5. min, 4. K/min, 200. C @ 20. min |
Capillary | DB-5 | 1380. | bin Ahmad and bin Jantan, 2003 | 25. m/0.25 mm/0.25 μm, N2, 75. C @ 10. min, 3. K/min, 210. C @ 1. min |
Capillary | DB-5 | 1385. | Bader, Caponi, et al., 2003 | 30. m/0.25 mm/0.25 μm, He, 3. K/min, 240. C @ 30. min; Tstart: 60. C |
Capillary | DB-1 | 1386. | Boyom, Assembe, et al., 2003 | 30. m/0.25 mm/0.25 μm, N2, 5. K/min, 200. C @ 0. min; Tstart: 50. C |
Capillary | HP-5 | 1386. | Dural, Bagci, et al., 2003 | 30. m/0.25 mm/0.25 μm, N2, 60. C @ 10. min, 5. K/min; Tend: 220. C |
Capillary | HP-5 | 1384. | Ertugrul, Dural, et al., 2003 | 30. m/0.25 mm/0.25 μm, N2, 60. C @ 10. min, 5. K/min; Tend: 220. C |
Capillary | DB-1 | 1368. | de Feo, Bruno, et al., 2003 | 30. m/0.25 mm/0.25 μm, He, 40. C @ 5. min, 2. K/min, 250. C @ 20. min |
Capillary | DB-1 | 1362. | Gancel, Ollitrault, et al., 2003 | 30. m/0.25 mm/0.25 μm, He, 3. K/min, 250. C @ 20. min; Tstart: 40. C |
Capillary | HP-5 | 1384. | Isidorov, Vinogorova, et al., 2003 | 25. C @ 5. min, 3. K/min; Column length: 30. m; Column diameter: 0.25 mm; Tend: 150. C |
Capillary | HP-5 | 1380. | Karioti, Skaltsa, et al., 2003 | 30. m/0.25 mm/0.25 μm, He, 60. C @ 5. min, 4. K/min; Tend: 280. C |
Capillary | HP-5 | 1385. | Macchioni, Cioni, et al., 2003 | 30. m/0.25 mm/0.25 μm, He, 3. K/min; Tstart: 60. C; Tend: 240. C |
Capillary | HP-5 | 1384. | Ngassapa, Runyoro, et al., 2003 | 30. m/0.25 mm/0.25 μm, He, 3. K/min; Tstart: 60. C; Tend: 280. C |
Capillary | HP-5 | 1385. | Shellie and Marriott, 2003 | 30. m/0.25 mm/0.25 μm, He, 3. K/min; Tstart: 40. C; Tend: 240. C |
Capillary | HP-5 | 1382. | Skaltsa, Demetzos, et al., 2003 | 30. m/0.25 mm/0.25 μm, He, 60. C @ 5. min, 4. K/min; Tend: 280. C |
Capillary | HP-5 | 1383. | Tzakou, Couladis, et al., 2003 | 30. m/0.25 mm/0.25 μm, He, 3. K/min; Tstart: 60. C; Tend: 280. C |
Capillary | SPB-1 | 1375. | Cavaleiro, Salgueiro, et al., 2002 | 30. m/0.20 mm/0.20 μm, He, 3. K/min, 220. C @ 15. min; Tstart: 70. C |
Capillary | RTX-5 MS | 1386. | Hudaib, Speroni, et al., 2002 | 30. m/0.25 mm/0.25 μm, He, 45. C @ 10. min, 2.5 K/min; Tend: 180. C |
Capillary | DB-1 | 1380. | bin Jantan and bin Ahmad, 2002 | N2, 60. C @ 10. min, 3. K/min, 180. C @ 10. min; Column length: 25. m; Column diameter: 0.25 mm |
Capillary | DB-5 | 1384. | Javidnia, Miri, et al., 2002 | He, 4. K/min; Column length: 25. m; Column diameter: 0.25 mm; Tstart: 70. C; Tend: 275. C |
Capillary | DB-5 | 1384. | Miri, Ramezani, et al., 2002 | He, 4. K/min; Column length: 25. m; Column diameter: 0.25 mm; Tstart: 70. C; Tend: 260. C |
Capillary | HP-1 | 1377. | Nath, Sarma, et al., 2002 | 24. m/0.32 mm/0.17 μm, He, 60. C @ 2. min, 4. K/min, 250. C @ 20. min |
Capillary | CP Sil 5 CB | 1381. | Pino, Marbot, et al., 2002 | 50. m/0.32 mm/0.4 μm, He, 60. C @ 10. min, 3. K/min, 280. C @ 60. min |
Capillary | RTX-5 | 1384. | Shellie, Mondello, et al., 2002 | 30. m/0.25 mm/0.25 μm, He, 45. C @ 6. min, 3. K/min; Tend: 250. C |
Capillary | RTX-5 | 1394. | Shellie, Mondello, et al., 2002 | 30. m/0.25 mm/0.25 μm, He, 45. C @ 6. min, 3. K/min; Tend: 250. C |
Capillary | HP-5 | 1384. | Aligiannis, Kalpoutzakis, et al., 2001 | 30. m/0.25 mm/0.25 μm, He, 60. C @ 5. min, 3. K/min; Tend: 280. C |
Capillary | HP-1 | 1400. | Guilliard, Delgado, et al., 2001 | 60. m/0.25 mm/0.25 μm, He, 50. C @ 5. min, 2.5 K/min; Tend: 250. C |
Capillary | HP-5 | 1384. | Guilliard, Delgado, et al., 2001 | 50. m/0.25 mm/0.25 μm, He, 50. C @ 5. min, 2.5 K/min; Tend: 250. C |
Capillary | RTX-5 MS | 1385. | Hudaib, Grazia Bellardi, et al., 2001 | 30. m/0.25 mm/0.25 μm, He, 70. C @ 10. min, 4. K/min, 210. C @ 10. min |
Capillary | BP-1 | 1386. | Rezzi, Cavaleiro, et al., 2001 | 50. m/0.22 mm/0.25 μm, 2. K/min, 220. C @ 20. min; Tstart: 60. C |
Capillary | HP-5MS | 1382. | Skaltsa, Mavrommati, et al., 2001 | 30. m/0.25 mm/0.25 μm, He, 60. C @ 5. min, 4. K/min; Tend: 280. C |
Capillary | HP-5 | 1378. | Kim, Thuy, et al., 2000 | 30. m/0.25 mm/0.25 μm, He, 40. C @ 5. min, 2. K/min, 200. C @ 20. min |
Capillary | DB-5 | 1383. | Maia, de Paula, et al., 2000 | 30. m/0.25 mm/0.25 μm, He, 60. C @ 2. min, 3. K/min; Tend: 240. C |
Capillary | DB-5 | 1383. | Maia, de Paula, et al., 2000 | 30. m/0.25 mm/0.25 μm, He, 60. C @ 2. min, 3. K/min; Tend: 240. C |
Capillary | DB-5 | 1384. | Maia, de Paula, et al., 2000 | 30. m/0.25 mm/0.25 μm, He, 60. C @ 2. min, 3. K/min; Tend: 240. C |
Capillary | HP-101 | 1369. | Milos and Radonic, 2000 | 25. m/0.2 mm/0.2 μm, He, 70. C @ 2. min, 3. K/min, 200. C @ 10. min |
Capillary | CP Sil 5 CB | 1391. | Pfeifhofer, 2000 | 50. m/0.22 mm/0.13 μm, H2, 4. K/min, 300. C @ 10. min; Tstart: 40. C |
Capillary | HP-5 | 1384. | Skaltsa, Lazari, et al., 2000 | 30. m/0.25 mm/0.25 μm, He, 50. C @ 5. min, 4. K/min; Tend: 280. C |
Capillary | HP-5 | 1384. | Lazari, Skaltsa, et al., 1999 | 30. m/0.25 mm/0.25 μm, He, 50. C @ 5. min, 4. K/min; Tend: 280. C |
Capillary | DB-1 | 1390. | Mirza and Sefidkon, 1999 | 60. m/0.25 mm/0.25 μm, He, 4. K/min; Tstart: 50. C; Tend: 220. C |
Capillary | DB-1 | 1369. | Muselli, Hoi, et al., 1999 | 30. m/0.25 mm/0.25 μm, 50. C @ 3. min, 3. K/min; Tend: 220. C |
Capillary | Methyl Silicone | 1405. | Sumathykutty, Rao, et al., 1999 | 50. m/0.25 mm/0.17 μm, N2, 2. K/min; Tstart: 80. C; Tend: 200. C |
Capillary | OV-1 | 1365. | Bicchi, Rubiolo, et al., 1998 | 25. m/0.25 mm/0.3 μm, 50. C @ 1. min, 3. K/min, 200. C @ 20. min |
Capillary | DB-5 | 1378. | Sagrero-Nieves, Bartley, et al., 1997 | 30. m/0.26 mm/0.25 μm, He, 2. K/min, 225. C @ 20. min; Tstart: 50. C |
Capillary | HP-101 | 1400. | Chung, Eiserich, et al., 1993 | N2, 3. K/min; Column length: 50. m; Column diameter: 0.25 mm; Tstart: 70. C; Tend: 200. C |
Capillary | CP Sil 5 CB | 1391. | Montanarella, Bos, et al., 1986 | N2, 4. K/min; Column length: 25. m; Column diameter: 0.22 mm; Tstart: 70. C; Tend: 295. C |

Van Den Dool and Kratz RI, non-polar column, custom temperature program

Column type | Active phase | I | Reference | Comment |
---|---|---|---|---|
Capillary | DB-5 | 1388. | Andrade, Sampaio, et al., 2007 | 30. m/0.25 mm/0.25 μm, He; Program: 40C(2min) => 4C/min => 220C => 20C/min => 280C |
Capillary | SE-52 | 1388. | Bruni, Bianchi, et al., 2007 | 30. m/0.32 mm/0.15 μm, He; Program: 45C => 1C/min => 100C => 5C/min => 250C(10min) |
Capillary | BPX-5 | 1397. | Cardeal, da Silva, et al., 2006 | 30. m/0.25 mm/0.25 μm; Program: 35C(5min) => 3C/min => 210C => 40C/min => 240C (4min) |
Capillary | DB-5 | 1417. | Özel, Gögüs, et al., 2006 | Program: not specified |
Capillary | SE-52 | 1388. | Bruni, Pellati, et al., 2005 | 30. m/0.32 mm/0.15 μm, He; Program: 45C => 1C/min => 100C => 5C/min => 250C(10min) |
Capillary | CBP-5 | 1383. | Oliveira, Campos, et al., 2005 | 30. m/0.25 mm/0.25 μm, He; Program: 60C => 3C/min => 240C => 10C/min => 280C(10min) |
Capillary | 5 % Phenyl methyl siloxane | 1388. | Sacchetti, Maietti, et al., 2005 | 30. m/0.32 mm/0.15 μm, He; Program: 45C => 1C/min => 100C => 5C/min => 250C (10min) |
Capillary | DB-5MS | 1385. | Zheng, Kim, et al., 2005 | 30. m/0.25 mm/0.25 μm, He; Program: 40 (5min) => 4C/min => 140C => 4C/min => 200C (20min) |
Capillary | SE-52 | 1380. | Lorenzo, Paz, et al., 2004 | 25. m/0.32 mm/0.4 μm; Program: 60C(8min) => 3C/min => 180C => 20C/min => 250C(10min) |
Capillary | SE-52 | 1387. | Sacchetti, Medici, et al., 2004 | 30. m/0.52 mm/0.15 μm, He; Program: 45C => 1C/min => 100C => 5C/min => 250C (10min) |
Capillary | CP Sil 8 CB | 1384. | Mockute and Judzentiene, 2003 | He; Column length: 50. m; Column diameter: 0.32 mm; Program: 60C (2min) => 5C/min => 160C (1min) => 10C/min => 250C (2min) |
Capillary | CBP-5 | 1380. | Azevedo, Campos, et al., 2002 | 50. m/0.25 mm/0.25 μm, He; Program: 60C(2min) => 3C/min => 240C => 10C/min => 280C(10min) |
Capillary | HP-5 | 1381. | Isidorov, Krajewska, et al., 2000 | 30. m/0.25 mm/0.25 μm; Program: 40C(1min) => 3C/min => 120C => 5C/min => 280C |
Capillary | SE-52 | 1385. | Lorenzo, Dellacassa, et al., 2000 | 25. m/0.25 mm/0.25 μm, He; Program: 60C(8min) => 3C/min => 180C => 20C/min => 230C |

Van Den Dool and Kratz RI, polar column, temperature ramp

Column type | Active phase | I | Reference | Comment |
---|---|---|---|---|
Capillary | BP-20 | 1516. | Lesueur, de Rocca Serra, et al., 2007 | 50. m/0.22 mm/0.25 μm, He, 2. K/min, 220. C @ 20. min; Tstart: 60. C |
Capillary | RTX-Wax | 1519. | Paolini J., Costa J., et al., 2007 | 60. m/0.22 mm/0.25 μm, He, 2. K/min, 230. C @ 35. min; Tstart: 60. C |
Capillary | HP-Wax | 1517. | Flamini, Tebano, et al., 2006 | 30. m/0.25 mm/0.25 μm, N2, 60. C @ 10. min, 5. K/min; Tend: 220. C |
Capillary | Supelcowax-10 | 1517. | Pinto, Pina-Vaz, et al., 2006 | 30. m/0.2 mm/0.2 μm, He, 3. K/min, 220. C @ 15. min; Tstart: 70. C |
Capillary | Supelcowax-10 | 1517. | Salgueiro L.R., Pinto E., et al., 2006 | 30. m/0.2 mm/0.2 μm, He, 3. K/min, 220. C @ 15. min; Tstart: 70. C |
Capillary | HP-20M | 1496. | Skocibusic, Bezic, et al., 2006 | 50. m/0.2 mm/0.2 μm, He, 70. C @ 4. min, 4. K/min, 180. C @ 10. min |
Capillary | DB-Wax | 1504. | Fanciullino, Gancel, et al., 2005 | 30. m/0.25 mm/0.25 μm, He, 3. K/min, 250. C @ 20. min; Tstart: 40. C |
Capillary | DB-Wax | 1502. | Gancel, Ollitrault, et al., 2005 | 30. m/0.25 mm/0.25 μm, He, 3. K/min, 250. C @ 20. min; Tstart: 40. C |
Capillary | Innowax | 1498. | Lee, Lee, et al., 2005 | 50. m/0.25 mm/0.25 μm, He, 50. C @ 3. min, 2. K/min, 220. C @ 20. min |
Capillary | RTX-Wax | 1519. | Paolini, Costa, et al., 2005 | 60. m/0.22 mm/0.25 μm, He, 2. K/min, 230. C @ 35. min; Tstart: 60. C |
Capillary | BP-20 | 1516. | Vellutini, Baldovini, et al., 2005 | 50. m/0.22 mm/0.25 μm, He, 2. K/min, 230. C @ 35. min; Tstart: 60. C |
Capillary | DB-Wax | 1530. | Bertoli, Menichini, et al., 2004 | 30. m/0.25 mm/0.25 μm, N2, 60. C @ 10. min, 5. K/min; Tend: 220. C |
Capillary | Supelcowax-10 | 1517. | Cavaleiro, Salgueiro, et al., 2004 | 30. m/0.2 mm/0.2 μm, He, 3. K/min, 220. C @ 15. min; Tstart: 70. C |
Capillary | HP-Wax | 1550. | Flamini, Luigi Cioni, et al., 2004 | 30. m/0.25 mm/0.25 μm, N2, 60. C @ 10. min, 5. K/min; Tend: 220. C |
Capillary | HP-Innowax | 1552. | Grujic-Jovanovic, Skaltsa, et al., 2004 | 30. m/0.25 mm/0.5 μm, He, 3. K/min; Tstart: 60. C; Tend: 260. C |
Capillary | HP-20M | 1496. | Skocibusic and Bezic, 2004 | 50. m/0.2 mm/0.2 μm, He, 70. C @ 4. min, 4. K/min, 180. C @ 10. min |
Capillary | DB-Wax | 1491. | Yu, Kim, et al., 2004 | 30. m/0.25 mm/0.25 μm, He, 40. C @ 5. min, 4. K/min, 200. C @ 20. min |
Capillary | HP-Wax | 1520. | Bader, Caponi, et al., 2003 | 30. m/0.25 mm/0.25 μm, N2, 60. C @ 10. min, 5. K/min; Tend: 220. C |
Capillary | DB-Wax | 1502. | Gancel, Ollitrault, et al., 2003 | 60. m/0.32 mm/0.25 μm, H2, 1.5 K/min, 245. C @ 20. min; Tstart: 40. C |
Capillary | HP-20M | 1513. | Jerkovic, Mastelic, et al., 2003 | 50. m/0.2 mm/0.2 μm, He, 70. C @ 4. min, 4. K/min, 180. C @ 10. min |
Capillary | HP-20M | 1496. | Radonic and Milso, 2003 | 50. m/0.2 mm/0.2 μm, He, 70. C @ 4. min, 5. K/min, 180. C @ 10. min |
Capillary | HP20Wax | 1496. | Skocibusic and Bezic, 2003 | 50. m/0.2 mm/0.2 μm, He, 70. C @ 4. min, 4. K/min, 180. C @ 10. min |
Capillary | AT-Wax | 1503. | Pino, Marbot, et al., 2002 | 60. m/0.32 mm/0.25 μm, He, 65. C @ 10. min, 2. K/min, 250. C @ 60. min |
Capillary | HP-20M | 1496. | Milos, Radonic, et al., 2001 | 50. m/0.20 mm/0.20 μm, He, 70. C @ 4. min, 4. K/min, 180. C @ 10. min |
Capillary | DB-Wax | 1515. | Brophy, Goldsack, et al., 2000 | 60. m/0.50 mm/1.0 μm, He, 3. K/min; Tstart: 60. C; Tend: 225. C |
Capillary | DB-Wax | 1515. | Brophy, Goldsack, et al., 2000, 2 | 60. m/0.53 mm/1.0 μm, He, 3. K/min; Tstart: 50. C; Tend: 220. C |
Capillary | DB-Wax | 1515. | Brophy, Goldsack, et al., 2000, 3 | 60. m/0.53 mm/1.0 μm, He, 3. K/min; Tstart: 50. C; Tend: 220. C |
Capillary | CP-Wax 52CB | 1530. | Chagonda, Makanda, et al., 2000 | 25. m/0.25 mm/0.15 μm, 40. C @ 5. min, 3. K/min; Tend: 220. C |
Capillary | DB-Wax | 1500. | Kim, Thuy, et al., 2000 | 30. m/0.25 mm/0.25 μm, He, 40. C @ 5. min, 2. K/min, 200. C @ 20. min |
Capillary | HP-20M | 1496. | Milos and Radonic, 2000 | 50. m/0.2 mm/0.2 μm, 70. C @ 4. min, 4. K/min, 180. C @ 10. min |
Capillary | DB-Wax | 1515. | Brophy, Goldsack, et al., 1999 | He, 3. K/min; Column length: 60. m; Column diameter: 0.53 mm; Tstart: 50. C; Tend: 220. C |
Capillary | DB-Wax | 1515. | Brophy, Goldsack, et al., 1999, 2 | He, 3. K/min; Column length: 60. m; Column diameter: 0.53 mm; Tstart: 50. C; Tend: 220. C |
Capillary | DB-Wax | 1518. | Brophy, Forster, et al., 1998 | He, 3. K/min; Column length: 60. m; Column diameter: 0.32 mm; Tstart: 35. C; Tend: 220. C |
Capillary | DB-Wax | 1515. | Brophy, Goldsack, et al., 1998 | He, 3. K/min; Column length: 60. m; Column diameter: 0.32 mm; Tstart: 65. C; Tend: 225. C |
Capillary | DB-Wax | 1515. | Brophy, Goldsack, et al., 1998, 2 | He, 3. K/min; Column length: 60. m; Column diameter: 0.32 mm; Tstart: 35. C; Tend: 220. C |
Capillary | DB-Wax | 1515. | Brophy, Goldsack, et al., 1997 | He, 3. K/min; Column length: 60. m; Column diameter: 0.32 mm; Tstart: 65. C; Tend: 225. C |
Capillary | SP-1000 | 1515. | Brophy, Goldsack, et al., 1997, 2 | He, 3. K/min; Column length: 85. m; Column diameter: 0.5 mm; Tstart: 65. C; Tend: 225. C |
Capillary | DB-Wax | 1540. | Sagrero-Nieves, Bartley, et al., 1997 | 60. m/0.32 mm/0.5 μm, He, 2. K/min, 225. C @ 20. min; Tstart: 50. C |

Van Den Dool and Kratz RI, polar column, custom temperature program

Column type | Active phase | I | Reference | Comment |
---|---|---|---|---|
Capillary | DB-Wax | 1502. | Zheng, Kim, et al., 2005 | 30. m/0.25 mm/0.25 μm, He; Program: 40 (5min) => 4C/min => 140C => 4C/min => 200C (20min) |
Capillary | Stabilwax | 1535. | Hudaib, Speroni, et al., 2002 | He; Program: 50C(8min) => 4C/min => 180C(10min) => 5C/min => 220C |
Capillary | HP-Innowax | 1510. | Bisio, Ciarallo, et al., 1998 | 30. m/0.25 mm/0.25 μm, He; Program: 60C(8min) => 3C/min => 180C(5min) => 40C/min => 250C |

Normal alkane RI, non-polar column, temperature ramp

Column type | Active phase | I | Reference | Comment |
---|---|---|---|---|
Capillary | RTX-1 | 1379. | Bendiabdellah, El Amine Dib, et al., 2012 | 60. m/0.22 mm/0.25 μm, Helium, 2. K/min, 230. C @ 5. min; Tstart: 60. C |
Capillary | DB-5 | 1393. | Boukhris, Bouaziz, et al., 2012 | 30. m/0.25 mm/0.25 μm, Helium, 100. C @ 1. min, 10. K/min, 260. C @ 10. min |
Capillary | HP-5 | 1378. | Velickovic, Ristic, et al., 2012 | 25. m/0.32 mm/0.52 μm, Hydrogen, 4. K/min, 280. C @ 10. min; Tstart: 40. C |
Capillary | HP-5 | 1378. | Velickovic, Ristic, et al., 2012 | 25. m/0.32 mm/0.52 μm, Hydrogen, 4. K/min, 280. C @ 10. min; Tstart: 40. C |
Capillary | HP-5 | 1378. | Velickovic, Ristic, et al., 2012 | 25. m/0.32 mm/0.52 μm, Hydrogen, 4. K/min, 280. C @ 10. min; Tstart: 40. C |
Capillary | DP-5 | 1339. | Vijayakumar, Duraipandiyan, et al., 2012 | 30. m/0.25 mm/0.25 μm, Helium, 80. C @ 1. min, 4. K/min, 300. C @ 40. min |
Capillary | DP-5 | 1339. | Vijayakumar, Duraipandiyan, et al., 2012 | 30. m/0.25 mm/0.25 μm, Helium, 80. C @ 1. min, 4. K/min, 300. C @ 40. min |
Capillary | HP-5 MS | 1388. | Zouari, Ayadi, et al., 2012 | 30. m/0.25 mm/0.25 μm, Helium, 50. C @ 1. min, 7. K/min, 250. C @ 5. min |
Capillary | HP-5 | 1388. | Bertoli, Lepnardi, et al., 2011 | 30. m/0.25 mm/0.25 μm, Helium, 3. K/min; Tstart: 60. C; Tend: 240. C |
Capillary | HP-5 MS | 1372. | Hammami, Kamoun, et al., 2011 | 30. m/0.25 mm/0.25 μm, Helium, 2. K/min; Tstart: 50. C; Tend: 180. C |
Capillary | DB-5 | 1384. | Karimi, Farmani, et al., 2011 | 30. m/0.25 mm/0.25 μm, Helium, 3. K/min; Tstart: 60. C; Tend: 240. C |
Capillary | HP-5 MS | 1429. | Zarai, Kadri, et al., 2011 | 30. m/0.25 mm/0.25 μm, Helium, 30. C @ 3. min, 5. K/min, 250. C @ 10. min |
Capillary | HP-5 | 1381. | Cavar, Maksimovic, et al., 2010 | 30. m/0.252 mm/0.25 μm, Helium, 3. K/min; Tstart: 60. C; Tend: 240. C |
Capillary | RTX-1 | 1386. | Dib, Djabou, et al., 2010 | 60. m/0.22 mm/0.25 μm, Helium, 2. K/min, 230. C @ 30. min; Tstart: 60. C |
Capillary | HP-5 | 1386. | Kahriman, Tosun, et al., 2010 | 30. m/0.32 mm/0.25 μm, Helium, 60. C @ 2. min, 3. K/min; Tend: 240. C |
Capillary | SPB-1 | 1375. | Lazarevic, Palic, et al., 2010 | 30. m/0.25 mm/0.25 μm, Helium, 50. C @ 3. min, 5. K/min, 250. C @ 15. min |
Capillary | DB-5 | 1383. | Magalhaes, Lima, et al., 2010 | 30. m/0.25 mm/0.25 μm, Helium, 3. K/min; Tstart: 60. C; Tend: 240. C |
Capillary | DB-5 MS | 1391. | Mesa-Arango, Betancur-Galvis, et al., 2010 | 60. m/0.25 mm/0.25 μm, Helium, 40. C @ 15. min, 5. K/min, 250. C @ 15. min |
Capillary | SPB-1 | 1375. | Neves, Rosa, et al., 2010 | 30. m/0.20 mm/0.20 μm, Helium, 3. K/min, 220. C @ 15. min; Tstart: 70. C |
Capillary | HP-5 MS | 1385. | Ogunwande, Flamini, et al., 2010 | 30. m/0.25 mm/0.25 μm, Helium, 60. C @ 10. min, 5. K/min; Tend: 220. C |
Capillary | HP-5 MS | 1380. | Pripdeevech, Chumpolsri, et al., 2010 | 30. m/0.25 mm/0.25 μm, Helium, 2. K/min; Tstart: 100. C; Tend: 220. C |
Capillary | HP-5 | 1392. | Radulovic, Dordevic, et al., 2010 | 30. m/0.25 mm/0.25 μm, Hydrogen, 5. K/min; Tstart: 70. C; Tend: 290. C |
Capillary | HP-5 MS | 1388. | Radulovic, Dordevic, et al., 2010, 2 | 30. m/0.25 mm/0.25 μm, Helium, 5. K/min, 290. C @ 10. min; Tstart: 70. C |
Capillary | DB-1 | 1378. | Xu, Tang, et al., 2010 | 30. m/0.25 mm/0.25 μm, Helium, 50. C @ 2. min, 4. K/min, 220. C @ 2. min |
Capillary | DB-5 | 1388. | Alim, Goze, et al., 2009 | 30. m/0.25 mm/0.25 μm, Helium, 3. K/min; Tstart: 60. C; Tend: 240. C |
Capillary | OV-101 | 1391. | Benites, Moiteiro, et al., 2009 | 50. m/0.25 mm/0.25 μm, Helium, 2. K/min; Tstart: 70. C; Tend: 220. C |
Capillary | SE-54 | 1379. | Dayisoylu and Alma, 2009 | 30. m/0.25 mm/0.25 μm, Helium, 60. C @ 5. min, 2. K/min, 260. C @ 999. min |
Capillary | DB-5 | 1384. | El-Massry, El-Ghorab, et al., 2009 | 30. m/0.25 mm/0.25 μm, Helium, 3. K/min, 220. C @ 40. min; Tstart: 35. C |
Capillary | SPB-5 | 1393. | Gilani, Shah, et al., 2009 | 30. m/0.53 mm/0.50 μm, Nitrogen, 50. C @ 5. min, 3. K/min, 210. C @ 45. min |
Capillary | DB-5 | 1388. | Ho, Wang, et al., 2009 | 30. m/0.25 mm/0.25 μm, Helium, 50. C @ 2. min, 5. K/min; Tend: 250. C |
Capillary | HP-5 | 1385. | Maridass, 2009 | 25. m/0.20 mm/0.33 μm, Helium, 3. K/min, 240. C @ 7. min; Tstart: 60. C |
Capillary | RTX-1 | 1379. | Museli, Pau, et al., 2009 | 60. m/0.22 mm/0.25 μm, Helium, 2. K/min, 230. C @ 30. min; Tstart: 60. C |
Capillary | RTX-1 | 1386. | Museli, Pau, et al., 2009 | 60. m/0.22 mm/0.25 μm, Helium, 2. K/min, 230. C @ 30. min; Tstart: 60. C |
Capillary | DB-5 | 1392. | Porto, Decorti, et al., 2009 | 30. m/0.25 mm/0.25 μm, Helium, 45. C @ 3. min, 3. K/min, 250. C @ 5. min |
Capillary | DB-5 | 1393. | Rahimi-Nasrabadi, Gholivand, et al., 2009 | 30. m/0.25 mm/0.25 μm, Nitrogen, 40. C @ 1. min, 3. K/min, 250. C @ 10. min |
Capillary | DB-5 | 1388. | Scrivanti, Anton, et al., 2009 | 30. m/0.25 mm/0.25 μm, Nitrogen, 2. K/min; Tstart: 40. C; Tend: 230. C |
Capillary | DB-5 MS | 1388. | Su, Wang, et al., 2009 | 30. m/0.25 mm/0.25 μm, Helium, 40. C @ 2. min, 4. K/min, 250. C @ 2. min |
Capillary | HP-5 MS | 1387. | Zhao, Zeng, et al., 2009 | 30. m/0.25 mm/0.25 μm, Helium, 4. K/min; Tstart: 50. C; Tend: 280. C |
Capillary | SE-52 | 1392. | Djarri, Medjroubi, et al., 2008 | 50. m/0.25 mm/0.25 μm, Helium, 3. K/min, 280. C @ 20. min; Tstart: 60. C |
Capillary | HP-5 | 1386. | Flamini, Tebano, et al., 2008 | 30. m/0.25 mm/0.25 μm, N2, 60. C @ 10. min, 5. K/min; Tend: 220. C |
Capillary | SLB-5 MS | 1385. | Lo Presti, Sciarrone, et al., 2008 | 30. m/0.25 mm/0.25 μm, Helium, 50. C @ 2. min, 3. K/min, 250. C @ 10. min |
Capillary | RTX-1 | 1388. | Paolini, Tomi, et al., 2008 | 60. m/0.22 mm/0.25 μm, He, 2. K/min, 230. C @ 35. min; Tstart: 60. C |
Capillary | RTX-5 | 1398. | Skalicka-Wozniak, Los, et al., 2008 | 20. m/0.18 mm/0.20 μm, Helium, 50. C @ 1. min, 4. K/min; Tend: 280. C |
Capillary | HP-5 | 1385. | Yassa and Akhani, 2008 | 30. m/0.25 mm/0.32 μm, Helium, 60. C @ 30. min, 5. K/min; Tend: 250. C |
Capillary | DB-5 | 1380. | Amiri, 2007 | 50. m/0.20 mm/0.32 μm, Nitrogen, 60. C @ 3. min, 5. K/min, 220. C @ 5. min |
Capillary | DB-5 | 1379. | Bos, Woerdenbag, et al., 2007 | 30. m/0.26 mm/0.25 μm, He, 3. K/min; Tstart: 60. C; Tend: 240. C |
Capillary | HP-5 MS | 1384. | Capetanos, Saroglou, et al., 2007 | 30. m/0.32 mm/0.25 μm, Helium, 60. C @ 5. min, 4. K/min; Tend: 280. C |
Capillary | HP-5 | 1384. | Cheraif, Ben Jannet, et al., 2007 | 30. m/0.25 mm/0.25 μm, N2, 50. C @ 1. min, 5. K/min, 240. C @ 4. min |
Capillary | DB-5 | 1379. | Elfami, Bos, et al., 2007 | 30. m/0.26 mm/0.25 μm, Helium, 3. K/min; Tstart: 60. C; Tend: 290. C |
Capillary | ZP-5 | 1407. | Füssel, Dötterl, et al., 2007 | 60. m/0.25 mm/0.25 μm, He, 40. C @ 7. min, 6. K/min, 260. C @ 1. min |
Capillary | DB-1 | 1393. | Ghasempour, Shirinpour, et al., 2007 | 60. m/0.25 mm/0.25 μm, Nitrogen, 60. C @ 1. min, 4. K/min, 250. C @ 10. min |
Capillary | Col-Elite 5MS | 1391. | Gudaityte and Venskutonis R.P., 2007 | 30. m/0.25 mm/0.25 μm, He, 3. K/min; Tstart: 30. C; Tend: 246. C |
Capillary | BP-1 | 1386. | Kiran, Devi, et al., 2007 | He, 5. K/min, 220. C @ 6. min; Tstart: 60. C |
Capillary | ZB-5 | 1381. | Mohottalage, Tabacchi, et al., 2007 | 30. m/0.25 mm/0.25 μm, 60. C @ 5. min, 4. K/min, 220. C @ 20. min |
Capillary | DB-1 | 1370. | Monser-Esfahani, Karamkhani, et al., 2007 | 30. m/0.25 mm/0.25 μm, Helium, 50. C @ 1. min, 2.5 K/min, 260. C @ 20. min |
Capillary | DB-5 | 1389. | Morteza-Semnani, Saeedi, et al., 2007 | 30. m/0.25 mm/0.25 μm, Helium, 4. K/min; Tstart: 60. C; Tend: 220. C |
Capillary | SPB-1 | 1378. | Pinto, Salgueiro, et al., 2007 | 30. m/0.2 mm/0.2 μm, He, 3. K/min, 220. C @ 15. min; Tstart: 70. C |
Capillary | DB-1 | 1393. | Reza, Ebrahim, et al., 2007 | 60. m/0.25 mm/0.25 μm, Nitrogen, 60. C @ 1. min, 4. K/min, 250. C @ 10. min |
Capillary | DB-1 | 1391. | Sonboli, Kanani, et al., 2007 | 60. m/0.25 mm/0.25 μm, Nitrogen, 5. K/min, 250. C @ 10. min; Tstart: 60. C |
Capillary | DB-5 | 1382. | Sylvestre, Longtin, et al., 2007 | 30. m/0.25 mm/0.25 μm, 2. K/min, 210. C @ 33. min; Tstart: 40. C |
Capillary | Elite-5MS | 1387. | Tava, Pecetti, et al., 2007 | 30. m/0.32 mm/0.5 μm, He, 40. C @ 5. min, 4. K/min, 280. C @ 10. min |
Capillary | HP-5MS | 1346. | Tzakou, Bazos, et al., 2007 | 30. m/0.25 mm/0.25 μm, He, 3. K/min; Tstart: 60. C; Tend: 280. C |
Capillary | HP-5 MS | 1388. | Vagionas, Graikou, et al., 2007 | 30. m/0.25 mm/0.25 μm, Helium, 3. K/min; Tstart: 60. C; Tend: 280. C |
Capillary | HP-5 | 1339. | Wenguang, Wenlai, et al., 2007 | 30. m/0.25 mm/0.25 μm, 40. C @ 3. min, 5. K/min, 240. C @ 10. min |
Capillary | HP-5 | 1385. | Yassa and Akhani, 2007 | 30. m/0.25 mm/0.32 μm, He, 60. C @ 30. min, 5. K/min; Tend: 250. C |
Capillary | DB-5 | 1374. | Apel, Sobral, et al., 2006 | 30. m/0.25 mm/0.25 μm, He, 3. K/min; Tstart: 60. C; Tend: 300. C |
Capillary | CP Sil 5 CB | 1384. | Ayoub, Al-Azizi, et al., 2006 | He, 10. K/min; Column length: 25. m; Tstart: 80. C; Tend: 270. C |
Capillary | HP-1 | 1387. | Castel, Fernandez, et al., 2006 | 50. m/0.2 mm/0.5 μm, He, 2. K/min, 250. C @ 120. min; Tstart: 60. C |
Capillary | HP-1 | 1387. | Castel, Fernandez, et al., 2006 | 50. m/0.2 mm/0.33 μm, He, 60. C @ 4. min, 2. K/min, 250. C @ 30. min |
Capillary | HP-5MS | 1381. | Ebrahim Sajjadi and Mehregan, 2006 | 30. m/0.25 mm/0.25 μm, 4. K/min; Tstart: 60. C; Tend: 280. C |
Capillary | DB-5 | 1379. | Elfami, Komar, et al., 2006 | 30. m/0.26 mm/0.25 μm, Helium, 3. K/min; Tstart: 60. C; Tend: 290. C |
Capillary | HP-5 | 1384. | Figuérédo, Cabassu, et al., 2006 | 30. m/0.25 mm/0.25 μm, He, 50. C @ 5. min, 5. K/min, 300. C @ 5. min |
Capillary | DB-1 | 1386. | Gohari, Hadjiakhoondi, et al., 2006 | 60. m/0.25 mm/0.25 μm, He, 60. C @ 2. min, 5. K/min; Tend: 240. C |
Capillary | DB-5 | 1384. | Gohari, Hadjiakhoondi, et al., 2006 | 30. m/0.25 mm/0.25 μm, He, 60. C @ 2. min, 5. K/min; Tend: 240. C |
Capillary | DB-1 | 1386. | Gohari A.R., Hadjiakhoondi A., et al., 2006 | 60. m/0.25 mm/0.25 μm, He, 60. C @ 2. min, 5. K/min; Tend: 240. C |
Capillary | DB-5 | 1384. | Gohari A.R., Hadjiakhoondi A., et al., 2006 | 30. m/0.25 mm/0.25 μm, He, 60. C @ 2. min, 5. K/min; Tend: 240. C |
Capillary | BP-1 | 1386. | Kiran, Bhavani, et al., 2006 | Helium, 5. K/min, 220. C @ 6. min; Tstart: 60. C |
Capillary | HP-5 | 1387. | Kucuk, Gulec, et al., 2006 | 30. m/0.32 mm/0.25 μm, Helium, 60. C @ 2. min, 5. K/min, 260. C @ 13. min |
Capillary | CP Sil 5 CB | 1374. | Lis and Milczarek, 2006 | 30. m/0.32 mm/0.25 μm, N2, 4. K/min; Tstart: 50. C; Tend: 300. C |
Capillary | 5 % Phenyl methyl siloxane | 1357. | Marongiu, Piras, et al., 2006 | 30. m/0.25 mm/0.25 μm, Helium, 3. K/min, 280. C @ 30. min; Tstart: 60. C |
Capillary | BP-1 | 1403. | Moody, Gundidza, et al., 2006 | He, 70. C @ 2. min, 4. K/min, 220. C @ 10. min; Column length: 25. m; Column diameter: 0.3 mm |
Capillary | DB-5 | 1390. | Morteza-Semnani, Akbarzadeh, et al., 2006 | 30. m/0.25 mm/0.25 μm, He, 4. K/min; Tstart: 60. C; Tend: 220. C |
Capillary | DB-5 | 1393. | Morteza-Semnani K., Akbarzadeh M., et al., 2006 | 30. m/0.25 mm/0.25 μm, He, 60. C @ 5. min, 4. K/min; Tend: 220. C |
Capillary | NB-30 | 1381. | Orav, Raal, et al., 2006 | 30. m/0.2 mm/0.25 μm, He, 2. K/min; Tstart: 50. C; Tend: 250. C |
Capillary | DB-5 | 1390. | Ouamba, Ouabonzi, et al., 2006 | 25. m/0.25 mm/0.15 μm, N2, 50. C @ 3. min, 4. K/min; Tend: 200. C |
Capillary | DB-1 | 1386. | Pala-Paul J., Perez-Alonso M.J., et al., 2006 | 50. m/0.25 mm/0.25 μm, N2, 4. K/min; Tstart: 95. C; Tend: 240. C |
Capillary | HP-5MS | 1388. | Petrovic, Ristic, et al., 2006 | 30. m/0.25 mm/0.25 μm, He, 4. K/min; Tstart: 40. C; Tend: 260. C |
Capillary | HP-5 | 1373. | Pintore G., Chessa M., et al., 2006 | 30. m/0.25 mm/0.25 μm, He, 60. C @ 10. min, 5. K/min; Tend: 220. C |
Capillary | DB-5 | 1384. | Pino, Marbot, et al., 2006 | 30. m/0.25 mm/0.25 μm, Hydrogen, 70. C @ 4. min, 4. K/min; Tend: 280. C |
Capillary | DB-5 | 1384. | Pino, Marbot, et al., 2006 | 30. m/0.25 mm/0.25 μm, Hydrogen, 70. C @ 4. min, 4. K/min; Tend: 280. C |
Capillary | HP-5MS | 1351. | Pitarokili, Tzakou, et al., 2006 | 30. m/0.25 mm/0.25 μm, He, 3. K/min; Tstart: 60. C; Tend: 280. C |
Capillary | DB-1 | 1379. | Sefidkon, Jamzad, et al., 2006 | He, 4. K/min; Column length: 60. m; Column diameter: 0.25 mm; Tstart: 40. C; Tend: 250. C |
Capillary | SPB-5 | 1383. | Stojanovic, Palic, et al., 2006 | He, 50. C @ 3. min, 5. K/min, 250. C @ 15. min |
Capillary | Methyl Silicone | 1397. | Tonzibo, Coffy, et al., 2006 | 25. m/0.3 mm/0.15 μm, N2, 50. C @ 5. min, 2. K/min; Tend: 210. C |
Capillary | SPB-5 | 1418. | Tornambe, Cornu, et al., 2006 | 60. m/0.32 mm/1. μm, He, 40. C @ 5. min, 3. K/min, 230. C @ 2. min |
Capillary | HP-5MS | 1363. | Basta, Tzakou, et al., 2005 | 30. m/0.25 mm/0.25 μm, He, 3. K/min; Tstart: 60. C; Tend: 280. C |
Capillary | DB-5 | 1384. | Bos, Stojanova, et al., 2005 | 30. m/0.249 mm/0.25 μm, He, 3. K/min; Tstart: 60. C; Tend: 290. C |
Capillary | DB-5 | 1382. | Chagonda and Chalchat, 2005 | 50. m/0.3 mm/0.25 μm, 2. K/min; Tstart: 60. C; Tend: 240. C |
Capillary | DB-5 | 1382. | Chagonda and Chalchat, 2005, 2 | 25. m/0.25 mm/0.15 μm, 40. C @ 5. min, 3. K/min; Tend: 220. C |
Capillary | DB-5 | 1384. | Chaverri and Cicció, 2005 | 30. m/0.25 mm/0.25 μm, He, 3. K/min; Tstart: 60. C; Tend: 240. C |
Capillary | DB-5 | 1384. | Chaverri and Cicció, 2005 | 30. m/0.25 mm/0.25 μm, He, 3. K/min; Tstart: 60. C; Tend: 240. C |
Capillary | Methyl Silicone | 1382. | Chalchat and Özcan, 2005 | He, 3. K/min; Column length: 60. m; Column diameter: 0.3 mm; Tstart: 50. C; Tend: 240. C |
Capillary | SPB-5 | 1418. | Cornu, Kondjoyan, et al., 2005 | 60. m/0.32 mm/1. μm, He, 40. C @ 5. min, 3. K/min; Tend: 230. C |
Capillary | HP-5 | 1385. | Duarte, Figueira, et al., 2005 | 25. m/0.2 mm/0.33 μm, He, 3. K/min, 240. C @ 7. min; Tstart: 60. C |
Capillary | CP Sil 8 CB | 1382. | Facey, Porter, et al., 2005 | 30. m/0.25 mm/0.25 μm, He, 80. C @ 5. min, 3. K/min, 200. C @ 5. min |
Capillary | HP-5 | 1384. | Figuérédo, Cabassu, et al., 2005 | 30. m/0.25 mm/0.25 μm, He, 50. C @ 5. min, 5. K/min, 300. C @ 5. min |
Capillary | HP-5 | 1380. | Jovanovic, Kitic, et al., 2005 | 25. m/0.32 mm/0.52 μm, H2, 4. K/min; Tstart: 40. C; Tend: 240. C |
Capillary | DB-1 | 1366. | Khanavi, Ghasemian, et al., 2005 | 30. m/0.25 mm/0.25 μm, He, 50. C @ 1. min, 2.5 K/min, 265. C @ 20. min |
Capillary | DB-1 | 1370. | Khalighi-Sigaroodi, Hadijiakhoondi, et al., 2005 | 30. m/0.25 mm/0.25 μm, He, 50. C @ 1. min, 2.5 K/min, 265. C @ 30. min |
Capillary | DB-5 | 1389. | Kowalski and Wolski, 2005 | 30. m/0.25 mm/0.25 μm, 35. C @ 2. min, 4. K/min; Tend: 280. C |
Capillary | DB-5 | 1389. | Kowalski, 2005 | 30. m/0.25 mm/0.25 μm, Helium, 35. C @ 2. min, 4. K/min; Tend: 280. C |
Capillary | DB-5 | 1379. | Limberger, Sobral, et al., 2005 | 30. m/0.25 mm/0.25 μm, He, 3. K/min; Tstart: 60. C; Tend: 230. C |
Capillary | DB-5MS | 1360. | Marongiu, Piras, et al., 2005 | 30. m/0.25 mm/0.25 μm, He, 60. C @ 30. min, 3. K/min; Tend: 280. C |
Capillary | DB-5 | 1388. | Morteza-Semnani, Akbarzadeh, et al., 2005 | 30. m/0.25 mm/0.25 μm, He, 60. C @ 5. min, 4. K/min; Tend: 220. C |
Capillary | DB-5 | 1388. | Morteza-Semnani and Saeedi, 2005 | 30. m/0.25 mm/0.25 μm, He, 60. C @ 4. min, 4. K/min; Tend: 220. C |
Capillary | DB-5 | 1389. | Morteza-Semnani and Saeedi, 2005, 2 | 30. m/0.25 mm/0.25 μm, He, 60. C @ 4. min, 4. K/min; Tend: 220. C |
Capillary | DB-5 | 1382. | Najafpour Navaei, Mirza, et al., 2005 | 30. m/0.25 mm/0.25 μm, He, 50. C @ 5. min, 3. K/min; Tend: 250. C |
Capillary | HP-5 | 1394. | Oyedeji, Yani, et al., 2005 | 30. m/0.25 mm/0.25 μm, He, 5. K/min; Tstart: 70. C; Tend: 240. C |
Capillary | DB-1 | 1376. | Pala-Paul, Perez-Alonso, et al., 2005 | 50. m/0.25 mm/0.25 μm, N2, 4. K/min; Tstart: 95. C; Tend: 240. C |
Capillary | HP-5MS | 1388. | Petrakis, Roussis, et al., 2005 | 3. K/min; Column length: 30. m; Column diameter: 0.2 mm; Tstart: 60. C; Tend: 280. C |
Capillary | HP-5MS | 1382. | Sajjadi S.E. and Eskandari B., 2005 | 30. m/0.25 mm/0.25 μm, He, 4. K/min; Tstart: 60. C; Tend: 280. C |
Capillary | HP-5MS | 1385. | Sajjadi and Ghannadi, 2005 | 30. m/0.25 mm/0.25 μm, He, 4. K/min; Tstart: 60. C; Tend: 275. C |
Capillary | HP-5MS | 1380. | Sajjadi, 2005 | 30. m/0.25 mm/0.25 μm, He, 4. K/min; Tstart: 60. C; Tend: 280. C |
Capillary | DB-5 | 1385. | Salehi, Sefidkon, et al., 2005 | 30. m/0.25 mm/0.25 μm, He, 60. C @ 4. min, 3. K/min; Tend: 220. C |
Capillary | DB-1 | 1391. | Salehi, Sonboli, et al., 2005 | 60. m/0.25 mm/0.25 μm, He, 5. K/min, 250. C @ 10. min; Tstart: 60. C |
Capillary | DB-1 | 1368. | Sarkhail, Amin, et al., 2005 | 30. m/0.25 mm/0.25 μm, He, 50. C @ 1. min, 2.5 K/min, 265. C @ 20. min |
Capillary | DB-5 | 1383. | Sefidkon and Jamzad, 2005 | He, 4. K/min; Column length: 30. m; Column diameter: 0.25 mm; Tstart: 40. C; Tend: 240. C |
Capillary | PE-5 | 1378. | Singh, Raina, et al., 2005 | 30. m/0.32 mm/0.25 μm, H2, 60. C @ 2. min, 5. K/min, 230. C @ 4. min |
Capillary | DB-5 | 1388. | Skoula and Grayer, 2005 | 30. m/0.25 mm/0.25 μm, He, 3. K/min, 230. C @ 20. min; Tstart: 60. C |
Capillary | HP-5MS | 1382. | Slavkovska, Couladis, et al., 2005 | 30. m/0.25 mm/0.25 μm, He, 3. K/min; Tstart: 60. C; Tend: 280. C |
Capillary | DB-1 | 1389. | Sonboli, Salehi, et al., 2005 | 60. m/0.25 mm/0.25 μm, He, 5. K/min, 250. C @ 10. min; Tstart: 60. C |
Capillary | HP-5 MS | 1398. | Topçu, Barla, et al., 2005 | 30. m/0.25 mm/0.50 μm, He, 3. K/min, 260. C @ 20. min; Tstart: 60. C |
Capillary | DB-5 | 1352. | Tzakou and Constantinidis, 2005 | 30. m/0.32 mm/0.25 μm, He, 3. K/min; Tstart: 60. C; Tend: 280. C |
Capillary | DB-1 | 1366. | Velasco-Negueruela, Pérez-Alonso, et al., 2005 | 50. m/0.25 mm/0.25 μm, N2, 4. K/min; Tstart: 90. C; Tend: 240. C |
Capillary | HP-5 | 1356. | Aghel, Yamini, et al., 2004 | 30. m/0.25 mm/0.32 μm, He, 60. C @ 3. min, 5. K/min; Tend: 250. C |
Capillary | DB-5 | 1382. | JAvidnia, Mojab, et al., 2004 | 25. m/0.25 mm/0.25 μm, Nitrogen, 3. K/min; Tstart: 60. C; Tend: 240. C |
Capillary | RTX-1 | 1386. | Kalemba and Thiem, 2004 | 30. m/0.25 mm/0.25 μm, N2, 4. K/min; Tstart: 60. C; Tend: 300. C |
Capillary | DB-5 | 1381. | Limberger, Sobral, et al., 2004 | 30. m/0.25 mm/0.25 μm, He, 3. K/min; Tstart: 60. C; Tend: 300. C |
Capillary | DB-5 | 1383. | Lopez Arze, Collin, et al., 2004 | 30. m/0.25 mm/0.25 μm, 40. C @ 2. min, 2. K/min, 210. C @ 33. min |
Capillary | HP-5MS | 1381. | Malencic, Couladis, et al., 2004 | 30. m/0.25 mm/0.25 μm, He, 3. K/min; Tstart: 60. C; Tend: 280. C |
Capillary | HP-5MS | 1387. | Mehrabani, Asadipour, et al., 2004 | 30. m/0.25 mm/0.25 μm, He, 4. K/min; Tstart: 60. C; Tend: 275. C |
Capillary | DB-1 | 1384. | Nik, Mirza, et al., 2004 | 60. m/0.25 mm/0.25 μm, He, 4. K/min; Tstart: 50. C; Tend: 270. C |
Capillary | DB-1 | 1371. | Palá-Paúl, Velasco-Negueruela, et al., 2004 | 50. m/0.25 mm/0.25 μm, N2, 4. K/min; Tstart: 95. C; Tend: 240. C |
Capillary | NB-30 | 1383. | Raal, Paaver, et al., 2004 | 50. m/0.20 mm/0.25 μm, He, 2. K/min; Tstart: 50. C; Tend: 250. C |
Capillary | DB-1 | 1368. | Sarkhail, Amin, et al., 2004 | 30. m/0.25 mm/0.25 μm, He, 50. C @ 1. min, 2.5 K/min, 265. C @ 20. min |
Capillary | DB-1 | 1380. | Sefidkon and Shaabani, 2004 | 60. m/0.25 mm/0.25 μm, He, 40. C @ 5. min, 4. K/min; Tend: 280. C |
Capillary | DB-5 | 1388. | Tirillini, Pellegrino, et al., 2004 | 30. m/0.25 mm/0.25 μm, He, 3. K/min; Tstart: 60. C; Tend: 300. C |
Capillary | BPX-5 | 1405. | Vilaseca, Guy, et al., 2004 | 25. m/0.22 mm/1. μm, He, 60. C @ 5. min, 3. K/min, 250. C @ 10. min |
Capillary | HP-5MS | 1382. | Couladis, Özcan, et al., 2003 | 30. m/0.25 mm/0.25 μm, He, 3. K/min; Tstart: 60. C; Tend: 280. C |
Capillary | HP-5MS | 1393. | Feizbaksh, Saber Tehrani, et al., 2003 | 30. m/0.25 mm/0.25 μm, He, 60. C @ 20. min, 5. K/min, 220. C @ 20. min |
Capillary | DB-1 | 1372. | Fekam Boyom, Ngouana, et al., 2003 | 30. m/0.25 mm/0.25 μm, N2, 5. K/min; Tstart: 50. C; Tend: 200. C |
Capillary | HP-5MS | 1384. | Ghannadi, Aghazari, et al., 2003 | 30. m/0.25 mm/0.25 μm, He, 4. K/min; Tstart: 60. C; Tend: 275. C |
Capillary | HP-5MS | 1384. | Ghasemi, Asghari, et al., 2003 | 30. m/0.25 mm/0.25 μm, He, 4. K/min; Tstart: 60. C; Tend: 280. C |
Capillary | HP-5 | 1386. | Ghannadi and Zolfaghari, 2003 | 30. m/0.25 mm/0.25 μm, He, 4. K/min; Tstart: 60. C; Tend: 275. C |
Capillary | RSL-200 | 1386. | Jirovetz, Buchbauer, et al., 2003 | 30. m/0.32 mm/0.25 μm, H2, 40. C @ 5. min, 6. K/min, 280. C @ 5. min |
Capillary | RSL-200 | 1386. | Jirovetz, Buchbauer, et al., 2003, 2 | 30. m/0.32 mm/0.25 μm, H2, 40. C @ 5. min, 6. K/min, 280. C @ 5. min |
Capillary | DB-5 | 1394. | Juteau, Jerkovic, et al., 2003 | 50. m/0.2 mm/0.25 μm, He, 50. C @ 2. min, 3. K/min, 220. C @ 10. min |
Capillary | CP Sil 5 CB | 1380. | Khanavi, Hadjiakhoondi, et al., 2003 | 25. m/0.25 mm/0.39 μm, He, 5. K/min; Tstart: 60. C; Tend: 220. C |
Capillary | DB-5MS | 1386. | Maia, Taveira, et al., 2003 | 30. m/0.25 mm/0.25 μm, He, 3. K/min; Tstart: 60. C; Tend: 240. C |
Capillary | DB-5 | 1390. | Masotti, Juteau, et al., 2003 | 50. m/0.2 mm/0.25 μm, He, 50. C @ 2. min, 3. K/min; Tend: 220. C |
Capillary | DB-1 | 1380. | Mirza and Nik, 2003 | 60. m/0.25 mm/0.25 μm, He, 4. K/min; Tstart: 50. C; Tend: 270. C |
Capillary | DB-1 | 1385. | Mirza, Nik, et al., 2003 | 60. m/0.25 mm/0.25 μm, He, 4. K/min; Tstart: 50. C; Tend: 270. C |
Capillary | DB-5 | 1384. | Morteza-Semnani and Saeedi, 2003 | 30. m/0.25 mm/0.25 μm, He, 60. C @ 5. min, 4. K/min; Tend: 275. C |
Capillary | DB-1 | 1377. | Perez-Alonso, Velasco-Negueruela, et al., 2003 | 50. m/0.25 mm/0.25 μm, N2, 4. K/min; Tstart: 95. C; Tend: 240. C |
Capillary | HP-5 | 1365. | Pitarokili, Tzakou, et al., 2003 | 30. m/0.25 mm/0.25 μm, He, 3. K/min; Tstart: 60. C; Tend: 280. C |
Capillary | DB-5 | 1380. | Priestap, van Baren, et al., 2003 | 30. m/0.2 mm/0.25 μm, He, 75. C @ 4. min, 3. K/min; Tend: 220. C |
Capillary | DB-1 | 1406. | Rasooli and Mirmostafa, 2003 | 60. m/0.25 mm/0.25 μm, He, 4. K/min; Tstart: 40. C; Tend: 220. C |
Capillary | HP-5 | 1382. | Sajjadi and Mehregan, 2003 | 30. m/0.25 mm/0.25 μm, He, 4. K/min; Tstart: 60. C; Tend: 280. C |
Capillary | HP-5 | 1381. | Sajjadi and Mehregan, 2003, 2 | 30. m/0.25 mm/0.25 μm, He, 4. K/min; Tstart: 60. C; Tend: 280. C |
Capillary | HP-5 | 1384. | Stashenko, Jaramillo, et al., 2003 | 60. m/0.25 mm/0.25 μm, 40. C @ 15. min, 5. K/min; Tend: 250. C |
Capillary | HP-5 | 1384. | Stashenko, Jaramillo, et al., 2003 | 60. m/0.25 mm/0.25 μm, 40. C @ 15. min, 5. K/min; Tend: 250. C |
Capillary | HP-5 | 1384. | Stashenko, Jaramillo, et al., 2003 | 60. m/0.25 mm/0.25 μm, 40. C @ 15. min, 5. K/min; Tend: 250. C |
Capillary | Cross-Linked Methylsilicone | 1366. | Velasco-Negueruela, Pérez-Alonso, et al., 2003 | 25. m/0.2 mm/0.33 μm, He, 4. K/min; Tstart: 70. C; Tend: 250. C |
Capillary | HP-5 | 1379. | Velickovic, Randjelovic, et al., 2003 | 25. m/0.32 mm/0.53 μm, H2, 4. K/min; Tstart: 40. C; Tend: 280. C |
Capillary | HP-5 | 1388. | Velickovic, Randjelovic, et al., 2003 | 25. m/0.32 mm/0.53 μm, H2, 4. K/min; Tstart: 40. C; Tend: 280. C |
Capillary | HP-5 | 1381. | Velickovic, Ristic, et al., 2003 | 25. m/0.32 mm/0.53 μm, Helium, 4. K/min; Tstart: 40. C; Tend: 280. C |
Capillary | HP-5 | 1381. | Velickovic, Ristic, et al., 2003 | 25. m/0.32 mm/0.53 μm, Helium, 4. K/min; Tstart: 40. C; Tend: 280. C |
Capillary | HP-5 | 1382. | Velickovic, Ristic, et al., 2003 | 25. m/0.32 mm/0.53 μm, Helium, 4. K/min; Tstart: 40. C; Tend: 280. C |
Capillary | HP-5 | 1388. | Velickovic, Ristic, et al., 2003 | 25. m/0.32 mm/0.53 μm, Helium, 4. K/min; Tstart: 40. C; Tend: 280. C |
Capillary | DB-5 | 1383. | Zoghbi, Andrade, et al., 2003 | 30. m/0.25 mm/0.25 μm, He, 3. K/min; Tstart: 60. C; Tend: 240. C |
Capillary | CP Sil 5 CB | 1374. | Azaz. D., Demirci, et al., 2002 | 25. m/0.25 mm/0.4 μm, N2, 5. K/min, 260. C @ 40. min; Tstart: 60. C |
Capillary | DB-5 | 1383. | Bos, Koulman, et al., 2002 | 30. m/0.249 mm/0.25 μm, He, 3. K/min, 300. C @ 5. min; Tstart: 60. C |
Capillary | 5 % Phenyl methyl siloxane | 1385. | Cicció and Gómez-Laurito, 2002 | 30. m/0.25 mm/0.25 μm, He, 75. C @ 4. min, 3. K/min, 200. C @ 8. min |
Capillary | BP-1 | 1386. | Das, Ram, et al., 2002 | 25. m/0.50 mm/0.25 μm, N2, 5. K/min, 220. C @ 10. min; Tstart: 60. C |
Capillary | DB-5 | 1386. | Flamini, Ertugrul, et al., 2002 | 30. m/0.25 mm/0.25 μm, He, 3. K/min; Tstart: 60. C; Tend: 240. C |
Capillary | DB-1 | 1370. | Gancel, Ollé, et al., 2002 | 30. m/0.32 mm/0.25 μm, H2, 40. C @ 20. min, 3. K/min; Tend: 245. C |
Capillary | PTE-5 | 1384. | Gudzic, Djokovic, et al., 2002 | 60. m/0.32 mm/0.30 μm, H2, 4.3 K/min; Tstart: 60. C; Tend: 285. C |
Capillary | SE-30 | 1386. | Iñigo, Palá-Paúl, et al., 2002 | 50. m/0.25 mm/0.25 μm, He, 4. K/min; Tstart: 70. C; Tend: 240. C |
Capillary | DB-5 | 1385. | Kobaisy, Tellez, et al., 2002 | 30. m/0.25 mm/0.25 μm, He, 3. K/min; Tstart: 60. C; Tend: 240. C |
Capillary | DB-5 | 1390. | Krauze-Baranowska, Mardarowicz, et al., 2002 | 30. m/0.25 mm/0.25 μm, He, 35. C @ 2. min, 3. K/min, 280. C @ 15. min |
Capillary | OV-101 | 1389. | Kuiate, Bessière, et al., 2002 | He, 5. K/min; Column length: 25. m; Column diameter: 0.32 mm; Tstart: 50. C; Tend: 200. C |
Capillary | DB-5 | 1379. | Limberger, Simões-Pires, et al., 2002 | 30. m/0.25 mm/0.25 μm, He, 3. K/min; Tstart: 60. C; Tend: 250. C |
Capillary | DB-5MS | 1385. | Maia, Zoghbi, et al., 2002 | 30. m/0.25 mm/0.25 μm, He, 3. K/min; Tstart: 60. C; Tend: 240. C |
Capillary | DB-1 | 1391. | Norouzi-Arasi, Yavari, et al., 2002 | 30. m/0.25 mm/0.25 μm, He, 60. C @ 10. min, 4. K/min; Tend: 250. C |
Capillary | HP-1 | 1379. | Priestap, van Baren, et al., 2002 | 50. m/0.25 mm/0.25 μm, N2, 3. K/min; Tstart: 90. C; Tend: 220. C |
Capillary | DB-5 | 1385. | Schwob, Bessière, et al., 2002 | He, 3. K/min; Column length: 25. m; Column diameter: 0.2 mm; Tstart: 60. C; Tend: 220. C |
Capillary | DB-1 | 1377. | Sefidkon, Dabiri, et al., 2002 | He, 4. K/min; Column length: 60. m; Column diameter: 0.25 mm; Tstart: 40. C; Tend: 250. C |
Capillary | DB-1 | 1381. | Sefidkon, 2002 | 60. m/0.25 mm/0.25 μm, He, 40. C @ 5. min, 4. K/min; Tend: 280. C |
Capillary | DB-1 | 1361. | Velasco-Negueruela, Pérez-Alonso, et al., 2002 | 50. m/0.25 mm/0.25 μm, N2, 3. K/min; Tstart: 60. C; Tend: 240. C |
Capillary | HP-5 | 1384. | Velickovic, Randjelovic, et al., 2002 | 30. m/0.25 mm/0.25 μm, H2, 4. K/min; Tstart: 40. C; Tend: 280. C |
Capillary | DB-5MS | 1386. | Zoghbi, Andrade, et al., 2002 | 30. m/0.25 mm/0.25 μm, He, 3. K/min; Tstart: 60. C; Tend: 270. C |
Capillary | SPB-5 | 1385. | Cornu, Carnat, et al., 2001 | He, 40. C @ 5. min, 3. K/min, 220. C @ 15. min; Column length: 60. m; Column diameter: 0.32 mm |
Capillary | DB-1 | 1377. | Dabiri and Sefidkon, 2001 | 60. m/0.25 mm/0.25 μm, He, 40. C @ 5. min, 4. K/min; Tend: 280. C |
Capillary | DB-1 | 1377. | Dabiri and Sefidkon, 2001 | 60. m/0.25 mm/0.25 μm, He, 40. C @ 5. min, 4. K/min; Tend: 280. C |
Capillary | HP-5 | 1384. | Flamini, Cioni, et al., 2001 | 30. m/0.25 mm/0.25 μm, N2, 60. C @ 10. min, 5. K/min; Tend: 220. C |
Capillary | HP-5 | 1386. | Gallori, Flamini, et al., 2001 | 30. m/0.25 mm/0.25 μm, N2, 60. C @ 10. min, 5. K/min; Tend: 220. C |
Capillary | BP-1 | 1387. | Gupta, Mallavarapu, et al., 2001 | 30. m/0.25 mm/0.25 μm, N2, 5. K/min; Tstart: 60. C; Tend: 220. C |
Capillary | Optima-5 | 1390. | Jacquemond-Collet, Bessière, et al., 2001 | He, 50. C @ 3. min, 3. K/min; Column length: 30. m; Column diameter: 0.2 mm; Tend: 250. C |
Capillary | RTX-1 | 1387. | Kalemba, Marschall, et al., 2001 | 30. m/0.25 mm/0.25 μm, N2, 4. K/min; Tstart: 60. C; Tend: 300. C |
Capillary | DB-5MS | 1345. | Marongiu, Porcedda, et al., 2001 | 30. m/0.25 mm/0.25 μm, He, 3. K/min, 240. C @ 30. min; Tstart: 60. C |
Capillary | DB-1 | 1380. | Mirza, Ahmadi, et al., 2001 | 60. m/0.25 mm/0.25 μm, He, 4. K/min; Tstart: 50. C; Tend: 270. C |
Capillary | DB-1 | 1372. | Palá-Paúl, Pérez-Alonso, et al., 2001 | 30. m/0.25 mm/0.25 μm, N2, 4. K/min; Tstart: 80. C; Tend: 225. C |
Capillary | DB-5 | 1383.5 | Santos-Gomes and Fernandes-Ferreira, 2001 | 30. m/0.25 mm/0.25 μm, H2, 3. K/min; Tstart: 60. C; Tend: 285. C |
Capillary | DB-5 | 1384. | Tellez M., Estell R., et al., 2001 | 30. m/0.25 mm/0.25 μm, He, 3. K/min; Tstart: 60. C; Tend: 240. C |
Capillary | CP Sil 5 CB | 1380. | Baser, Özek, et al., 2000 | 25. m/0.25 mm/0.4 μm, He, 60. C @ 40. min, 5. K/min; Tend: 260. C |
Capillary | HP-1 | 1389. | Meccia, Rojas, et al., 2000 | 60. m/0.25 mm/0.25 μm, He, 60. C @ 5. min, 4. K/min, 200. C @ 25. min |
Capillary | DB-5 | 1385. | Tellez, Dayan, et al., 2000 | 30. m/0.25 mm/0.25 μm, He, 3. K/min; Tstart: 60. C; Tend: 240. C |
Capillary | RTX-1 | 1386. | Kalemba, 1999 | 30. m/0.25 mm/0.25 μm, N2, 4. K/min; Tstart: 60. C; Tend: 300. C |
Capillary | Ultra-2 | 1375. | Khalilov L.M., Khalilova A.Z., et al., 1999 | 32. C @ 5. min, 4. K/min; Column length: 50. m; Column diameter: 0.32 mm; Tend: 250. C |
Capillary | DB-1 | 1383. | Koulman, 1999 | 25. m/0.25 mm/0.25 μm, He, 4. K/min; Tstart: 50. C; Tend: 290. C |
Capillary | OV-101 | 1385. | Menon, Chacko, et al., 1999 | N2, 1. K/min, 200. C @ 20. min; Column length: 50. m; Column diameter: 0.2 mm; Tstart: 80. C |
Capillary | OV-1 | 1372. | Oberhofer, Nikiforov, et al., 1999 | 25. m/0.25 mm/0.25 μm, H2, 40. C @ 5. min, 3. K/min, 220. C @ 5. min |
Capillary | SE-30 | 1430. | Prikhod'ko, Klyuev, et al., 1999 | 30. m/0.25 mm/0.20 μm, Helium, 60. C @ 4. min, 3. K/min; Tend: 200. C |
Capillary | DB-1 | 1389. | Sefidkon, Dabiri, et al., 1999 | 60. m/0.25 mm/0.25 μm, He, 40. C @ 5. min, 4. K/min; Tend: 280. C |
Capillary | DB-5 | 1380. | Sefidkon and Khajavi, 1999 | 30. m/0.25 mm/0.25 μm, He, 40. C @ 5. min, 4. K/min; Tend: 220. C |
Capillary | DB-1 | 1390. | Sefidkon and Mirza, 1999 | 60. m/0.25 mm/0.25 μm, He, 4. K/min; Tstart: 50. C; Tend: 220. C |
Capillary | SPB-5 | 1415. | Viallon C., Verdier-Metz I., et al., 1999 | 60. m/0.32 mm/1. μm, He, 40. C @ 5. min, 3. K/min, 200. C @ 2. min |
Capillary | OV-101 | 1386. | Zollo, Biyiti, et al., 1998 | 5. K/min; Column length: 25. m; Column diameter: 0.32 mm; Tstart: 50. C; Tend: 200. C |
Capillary | DB-5 | 1382. | Elias, Simoneit, et al., 1997 | 30. m/0.25 mm/0.25 μm, He, 65. C @ 2. min, 4. K/min; Tend: 300. C |
Capillary | OV-1 | 1367. | Kökdil, Kurucu, et al., 1997 | 30. m/0.32 mm/0.25 μm, He, 40. C @ 4. min, 2. K/min; Tend: 270. C |
Capillary | OV-1 | 1365. | Kökdil, Tanker, et al., 1997 | 30. m/0.32 mm/0.25 μm, 40. C @ 4. min, 2. K/min; Tend: 270. C |
Capillary | DB-1 | 1379. | Salgueiro, Vila, et al., 1997 | 6. K/min; Tstart: 80. C; Tend: 220. C |
Capillary | DB-5 | 1385. | Tellez, Estell, et al., 1997 | 30. m/0.25 mm/0.25 μm, Helium, 3. K/min; Tstart: 60. C; Tend: 240. C |
Capillary | CBP-1 | 1380. | Zygadlo, Ariza-Espinar, et al., 1997 | He, 5. K/min; Column length: 25. m; Column diameter: 0.22 mm; Tstart: 60. C; Tend: 240. C |
Capillary | DB-5 | 1383.9 | Gawdzik, Mardarowicz, et al., 1996 | 30. m/0.25 mm/0.25 μm, 60. C @ 2. min, 4. K/min, 300. C @ 5. min |
Capillary | OV-101 | 1396. | Orav, Kailas, et al., 1996 | He, 2. K/min; Column length: 50. m; Column diameter: 0.25 mm; Tstart: 50. C; Tend: 250. C |
Capillary | BP-1 | 1382. | Rajeswara, Kaul, et al., 1996 | N2, 5. K/min; Column length: 25. m; Column diameter: 0.50 mm; Tstart: 60. C; Tend: 220. C |
Capillary | DB-1 | 1405. | Sagrero-Nieves and Bartley, 1996 | 60. m/0.32 mm/0.50 μm, He, 50. C @ 1. min, 8. K/min, 250. C @ 6. min |
Capillary | HP-1 | 1377. | Thanh, Dung, et al., 1996 | 25. m/0.32 mm/0.25 μm, Helium, 60. C @ 2. min, 4. K/min, 220. C @ 20. min |
Capillary | HP-101 | 1377. | Demarne and van der Walt, 1993 | 50. m/0.32 mm/0.3 μm, H2, 65. C @ 5. min, 2. K/min; Tend: 300. C |
Capillary | Methyl Silicone | 1378. | Mallavarapu, Ramesh, et al., 1993 | 5. K/min; Column length: 25. m; Column diameter: 0.50 mm; Tstart: 60. C; Tend: 220. C |
Capillary | DB-1 | 1381. | Binder, Turner, et al., 1990 | 4. K/min, 230. C @ 10. min; Tstart: 50. C |
Capillary | DB-1 | 1381. | Binder, Turner, et al., 1990, 2 | 4. K/min, 230. C @ 10. min; Column length: 60. m; Column diameter: 0.32 mm; Tstart: 50. C |
Capillary | DB-1 | 1380. | Binder and Flath, 1989 | 50. C @ 0.1 min, 4. K/min, 250. C @ 5. min; Column length: 60. m; Column diameter: 0.32 mm |
Capillary | OV-1 | 1380. | de Pooter, Nicolai, et al., 1988 | 50. m/0.20 mm/0.20 μm, He, 2. K/min; Tstart: 30. C; Tend: 220. C |
Capillary | SE-30 | 1382. | Ramaswami, Briscese, et al., 1988 | 50. C @ 2. min, 4. K/min, 240. C @ 10. min; Column length: 30. m |
Capillary | OV-101 | 1381. | Nykanen, 1986 | 40. C @ 5. min, 3.5 K/min; Column length: 50. m; Column diameter: 0.30 mm; Tend: 230. C |
Capillary | OV-101 | 1396. | Nykanen, 1986 | 40. C @ 5. min, 3.5 K/min; Column length: 50. m; Column diameter: 0.30 mm; Tend: 230. C |
Capillary | OV-101 | 1398. | Nykanen, 1986 | 40. C @ 5. min, 3.5 K/min; Column length: 50. m; Column diameter: 0.30 mm; Tend: 230. C |
Capillary | OV-101 | 1378. | De Pooter and Schamp, 1986 | 30. m/0.5 mm/0.8 μm, He, 2. K/min; Tstart: 40. C; Tend: 220. C |
Capillary | OV-101 | 1378. | De Pooter and Schamp, 1986 | 30. m/0.5 mm/0.8 μm, He, 2. K/min; Tstart: 40. C; Tend: 220. C |
Capillary | SE-30 | 1382. | Ramaswami, Briscese, et al., 1986 | 50. C @ 2. min, 4. K/min, 240. C @ 10. min; Column length: 30. m |
Capillary | SE-30+Igepal | 1406. | Shibamoto and Jennings, 1977 | 1. K/min; Column length: 100. m; Column diameter: 0.25 mm; Tstart: 70. C; Tend: 170. C |
Capillary | SE-30+Igepal | 1417. | Shibamoto and Jennings, 1977 | 1. K/min; Column length: 100. m; Column diameter: 0.25 mm; Tstart: 70. C; Tend: 170. C |

Normal alkane RI, non-polar column, custom temperature program

Column type | Active phase | I | Reference | Comment |
---|---|---|---|---|
Capillary | DB-1 | 1379. | Albano, Lima, et al., 2012 | 30. m/0.25 mm/0.25 μm, Hydrogen; Program: 45 0C 3 0C/min -> 175 0C 15 0C/min -> 300 0C (10 min) |
Capillary | RTX-1 | 1383. | Bendiabdellah, El Amine Dib, et al., 2012 | 60. m/0.22 mm/0.25 μm, Helium; Program: not specified |
Capillary | Polydimethyl siloxane with 5 % Ph groups | 1382. | da Silva, de Souza, et al., 2012 | 30. m/0.25 mm/0.25 μm, Helium; Program: 50 0C 4 0C/min -> 200 0C (5 min) 20 0C/min -> 280 0C |
Capillary | HP-5 | 1388. | Velickovic, Ristic, et al., 2012 | 25. m/0.32 mm/0.52 μm, Hydrogen; Program: not specified |
Capillary | 5 % Phenyl polydimethyl siloxane | 1381. | Chaverri, Diaz, et al., 2011 | Program: not specified |
Capillary | 1417. | Karimi, Farmany, et al., 2011 | Program: not specified | |
Capillary | HP-5 MS | 1366. | Bagci, Yazgin, et al., 2010 | 30. m/0.25 mm/0.25 μm, Helium; Program: 70 0C (2 min) 10 0C/min -> 150 0C (15 min) 5 0C/min -> 240 0C |
Capillary | RTX-1 | 1376. | Dib, Djabou, et al., 2010 | 60. m/0.22 mm/0.25 μm, Helium; Program: not specified |
Capillary | HP-5 | 1388. | Kahriman, Tosun, et al., 2010 | 30. m/0.32 mm/0.25 μm, Helium; Program: not specified |
Capillary | HP-5 MS | 1385. | Liu, Chu, et al., 2010 | 30. m/0.25 mm/0.25 μm, Helium; Program: 60 0C (1 min) 10 0C/min -> 180 0C (1 min) 20 0C/min -> 280 0C (15 min) |
Capillary | DB-1 | 1362. | Xu, Tang, et al., 2010 | 30. m/0.25 mm/0.25 μm, Helium; Program: not specified |
Capillary | DB-5 | 1390. | Courtois, Paine, et al., 2009 | 30. m/0.25 mm/0.25 μm, Helium; Program: 50 0C m6 0C/min -> 140 0C 5 0C/min -> 160 0C (1 min) 10 0C/min -> 200 0C |
Capillary | HP-5 | 1381. | Maggi, Bilek, et al., 2009 | 25. m/0.32 mm/0.17 μm, Helium; Program: 60 0C (5 min) 4 0C/min -> 220 0C 11 0C/min -> 280 0C |
Capillary | HP-5 MS | 1385. | Mancini, Arnold, et al., 2009 | 30. m/0.25 mm/0.25 μm, Helium; Program: 40 0C (5 min) 2 0C/min -> 270 0C -> 260 0C (20 min) |
Capillary | DB-1 | 1379. | Mendes, Trindade, et al., 2009 | 30. m/0.25 mm/0.25 μm, Hydrogen; Program: 45 0C 3 0C/min -> 175 0C 15 0C/min -> 300 0C (10 min) |
Capillary | DB-5 | 1394. | Porto, Decorti, et al., 2009 | 30. m/0.25 mm/0.25 μm, Helium; Program: not specified |
Capillary | DB-5 | 1417. | Porto, Decorti, et al., 2009 | 30. m/0.25 mm/0.25 μm, Helium; Program: not specified |
Capillary | DB-5 MS | 1384. | Su, Wang, et al., 2009 | 30. m/0.25 mm/0.25 μm, Helium; Program: not specified |
Capillary | CP Sil 8 CB | 1386. | Kupcinskiene, Stikliene, et al., 2008 | 50. m/0.32 mm/0.25 μm, Helium; Program: not specified |
Capillary | SLB-5 MS | 1388. | Lo Presti, Sciarrone, et al., 2008 | 30. m/0.25 mm/0.25 μm, Helium; Program: not specified |
Capillary | DB-1 | 1379. | Nogueira, Marcelo-Curto, et al., 2008 | 30. m/0.25 mm/0.25 μm, He; Program: 45C => 3C/min => 175C => 15C/min => 300C (10min) |
Capillary | 5 % Phenyl methyl siloxane | 1418. | Agabriel, Cornu, et al., 2007 | Program: not specified |
Capillary | DB-5 | 1385. | Albuquerque, Lemos, et al., 2007 | 30. m/0.25 mm/0.25 μm, He; Program: 35C => 4C/min => 180C => 10C/min => 250C |
Capillary | DB-1 | 1383. | Albuquerque, Vasconcelos Silva, et al., 2007 | 30. m/0.25 mm/0.1 μm, He; Program: 35C => 4C/min => 180C => 10C/min => 250C |
Capillary | HP-5MS | 1384. | Cole, Haber, et al., 2007 | 30. m/0.25 mm/0.25 μm, He; Program: 40C(10min) => 3C/min => 200C => 2C/min => 220C |
Capillary | HP-5MS | 1385. | Formisano, Mignola, et al., 2007 | 30. m/0.25 mm/0.25 μm, He; Program: 40C(5min) => 2C/min => 250C(15min) => 10C/min => 270C |
Capillary | HP-5 MS | 1385. | Formisano, Rigano, et al., 2007 | 30. m/0.25 mm/0.25 μm, Helium; Program: 40 0C (5 min) 2 0C/min -> 250 0C (15 min) 10 0C/min -> 270 0C |
Capillary | DB-5 MS | 1391. | Haznagy-Radnai, Szigle, et al., 2007 | 30. m/0.25 mm/0.25 μm, Helium; Program: 60 0C 3 0C/min -> 210 0C 5 0C/min -> 250 0C |
Capillary | HP-5 | 1376. | Liolios, Laouer, et al., 2007 | Program: not specified |
Capillary | CP Sil 8 CB | 1381. | Meekijjaroenroj, Bessière, et al., 2007 | 30. m/0.25 mm/0.25 μm, He; Program: 50C(3min) => 3C/min => 100C => 2.7C/min => 140C => 2.4C/min => 180C => 6C/min => 250C |
Capillary | CP Sil 8 CB | 1388. | Mockute, Bernotiene, et al., 2007 | 50. m/0.32 mm/0.25 μm, He; Program: 60 0C (2 min) 5 0C/min -> 160 0C 5 0C/min -> 250 0C (10 min) |
Capillary | HP-5 MS | 1385. | Moriarity, Bansal, et al., 2007 | 30. m/0.25 mm/0.25 μm, Helium; Program: 40 0C (10 min) 3 0C/min -> 200 0C 2 0C/min -> 220 0C |
Capillary | HP-5MS | 1384. | Moronkola, Ogunwande, et al., 2007 | 30. m/0.25 mm/0.25 μm, He; Program: 40C(10min) => 3C/min => 200C => 2C/min => 220C |
Capillary | DB-5 | 1388. | Nivinsliene, Butkiene, et al., 2007 | 50. m/0.32 mm/0.25 μm, Helium; Program: 60 0C (1 min) 5 0C/min -> 160 0C 10 0C/min -> 250 0C |
Capillary | DB-5 | 1388. | Parker, Pollnitz, et al., 2007 | 30. m/0.25 mm/0.25 μm, He; Program: 50C(1min) => 3C/min => 250C(10min) => 20C/min => 280C (5min) |
Capillary | DB-5 | 1384. | Pontes, de Olivera, et al., 2007 | 30. m/0.25 mm/0.25 μm, Hydrogen; Program: not specified |
Capillary | DB-1 | 1379. | Rodrigues, Antunes, et al., 2007 | 30. m/0.25 mm/0.25 μm, He; Program: 45C => 3C/min => 175C => 15C/min => 300C(10min) |
Capillary | 5 % Phenyl methylsiloxane | 1415. | Serrano, Cornu, et al., 2007 | Program: not specified |
Capillary | HP-5 MS | 1386. | Setzer, Stokes, et al., 2007 | Helium; Column length: 30. m; Column diameter: 0.25 mm; Program: 40 0C (10 min) 3 oC/min -> 200 0C 2 0C/min -> 220 0C |
Capillary | HP-5 MS | 1384. | Stokes, Cole, et al., 2007 | Program: not specified |
Capillary | HP-5MS | 1385. | Takaku, Haber, et al., 2007 | He; Column length: 30. m; Column diameter: 0.25 mm; Program: 40C(10min) => 3C/min => 200C => 2C/min => 220C |
Capillary | HP-5MS | 1385. | Formisano C., Senatore F., et al., 2006 | 30. m/0.25 mm/0.25 μm, He; Program: 40C(5min) => 2C/min => 250C(15min) => 10C/min => 270C |
Capillary | HP-5MS | 1412. | Güllüce, Özer, et al., 2006 | 30. m/0.25 mm/0.25 μm, He; Program: 50C(3min) => 3C/min => 150C(10min) => 10C/min => 250C |
Capillary | CP Sil 8 CB | 1388. | Judzentiene and Buzelyte, 2006 | 50. m/0.32 mm/0.25 μm, He; Program: 60C(2min) => 5C/min => 160C(1min) => 10C/min => 250C (5min) |
Capillary | HP-5 | 1388. | Kucuk, Gulec, et al., 2006 | 30. m/0.32 mm/0.25 μm, Helium; Program: not specified |
Capillary | CP Sil 8 CB | 1384. | Mockute, Bernotiene, et al., 2006 | 50. m/0.32 mm/0.25 μm, He; Program: 60 0C (2 min) 5 0C/min -> 160 0C 10 0C/min -> 250 0C (5 min) |
Capillary | DB-5 | 1388. | Santos, Nunes, et al., 2006 | 30. m/0.25 mm/0.25 μm, He; Program: 35C => 4C/min => 180C => 10C/min => 250C |
Capillary | HP-5 MS | 1384. | Schmidt, Noletto, et al., 2006 | 30. m/0.25 mm/0.25 μm, Helium; Program: 40 0C (10 min) 3 0C/min -> 200 0C 2 0C/min -> 220 0C |
Capillary | HP-5 MS | 1384. | Schmidt, Noletto, et al., 2006 | 30. m/0.25 mm/0.25 μm, Helium; Program: 40 0C (10 min) 3 0C/min -> 200 0C 2 0C/min -> 220 0C |
Capillary | DB-1 | 1384. | Soumaghi, Amin, et al., 2006 | Helium; Program: not specified |
Capillary | SE-52 | 1388. | Tognolini, Barocelli, et al., 2006 | 30. m/0.32 mm/0.15 μm, He; Program: 45C => 1C/min => 100C => 5C/min => 250C (10min) |
Capillary | DB-5MS | 1371. | Bagci and Baser, 2005 | 30. m/0.25 mm/0.25 μm; Program: 70C(2min) => 10C/min => 150C(15min) => 5C/min => 240C |
Capillary | CP Sil 8 CB | 1388. | Butkienë, Nivinskienë, et al., 2005 | 50. m/0.32 mm/0.25 μm, He; Program: 50C(5min) => 2C/min => 90C => 15C/min => 240C(4min) |
Capillary | DB-1 | 1379. | Figueiredo, Sim-Sim, et al., 2005 | 30. m/0.25 mm/0.25 μm, He; Program: 45C => 3C/min => 175C => 15C/min => 300C (10min) |
Capillary | DB-5 | 1388. | Hamm, Bleton, et al., 2005 | 30. m/0.25 mm/0.25 μm, He; Program: 40C(1min) => 9C/min => 130C => 2C/min => 230C |
Capillary | CP Sil 8 CB | 1388. | Nivinskienë, Butkienë, et al., 2005 | 50. m/0.32 mm/0.25 μm, He; Program: 60C(1min) => 5C/min => 160C => 5C/min => 250C(3min) |
Capillary | CP Sil 8 CB | 1387. | Radudienë, Judpintienë, et al., 2005 | 50. m/0.32 mm/0.25 μm, He; Program: 60C(2min) => 5C/min => 160C(1min) => 10C/min => 250C (3min) |
Capillary | CP Sil 8 CB | 1388. | Butkienë, Nivinskienë, et al., 2004 | 50. m/0.32 mm/0.25 μm, He; Program: 50C(5min) => 2C/min => 90C => 15C/min => 240C(4min) |
Capillary | Methyl Silicone | 1382. | Couladis, Özcan, et al., 2004 | Program: not specified |
Capillary | OV-1 | 1379. | El-Shazly and Hussein, 2004 | He; Column length: 15. m; Column diameter: 0.317 mm; Program: 50C(4min) => 4C/min => 90C => 10C/min => 300C(10min) |
Capillary | DB-5 | 1388. | Hamm, Bleton, et al., 2004 | 30. m/0.25 mm/0.25 μm, He; Program: 40C(1min) => 9C/min => 130C => 2C/min => 230C |
Capillary | CP Sil 8 CB | 1384. | Judpentienë and Mockutë, 2004 | He; Column length: 50. m; Column diameter: 0.32 mm; Program: 60C(2min) => 5C/min => 160C (1min) => 10C/min => 250C (2min) |
Capillary | CP Sil 8 CB | 1384. | Judpentienë and Mockutë, 2004, 2 | 50. m/0.32 mm/0.25 μm, He; Program: 60C(2min) => 5C/min => 160C(1min) => 10C/min => 250C (5min) |
Capillary | DB-1 | 1379. | Miguel, Simões, et al., 2004 | 30. m/0.25 mm/0.25 μm, He; Program: 45C => 3C/min => 175C => 15C/min => 300C (10min) |
Capillary | CP Sil 8 CB | 1387. | Mockutë, Bernotienë, et al., 2004 | He; Column length: 50. m; Column diameter: 0.32 mm; Program: 50 0C (2 min) 3 0C/min -> 180 0C (1 min) 20 0C/min -> 250 0C (2 min) |
Capillary | CP Sil 8 CB | 1387. | Mockutë, Judbentienë, et al., 2004 | 50. m/0.32 mm/0.25 μm, He; Program: 50C(2min) => 3C/min => 180C(1min) => 20C/min => 250C (2min) |
Capillary | HP-5MS | 1388. | Sahin, Gulluce, et al., 2004 | 30. m/0.25 mm/0.25 μm, He; Program: 50C(3min) => 3C/min => 150C(10min) => 10C/min => 250C |
Capillary | HP-5 | 1385. | Senatore, Apostolides Arnold, et al., 2004 | 30. m/0.25 mm/0.25 μm; Program: 40C(5min) => 2C/min => 250C(15min) => 10C/min => 270C |
Capillary | DB-5 | 1384. | Vilaseca, Guy, et al., 2004 | Program: not specified |
Capillary | SE-30 | 1385. | Vinogradov, 2004 | Program: not specified |
Capillary | DB-5 | 1388. | Hamm, Lesellier, et al., 2003 | 30. m/0.25 mm/0.25 μm, He; Program: 40C (1min) => 9C/min => 130C => 2C/min => 230C |
Capillary | CP-Sil 8CB-MS | 1384. | Mockute, Bernotiene, et al., 2003 | Column length: 50. m; Column diameter: 0.32 mm; Program: 60C(1min) => 3C/min => 70C => 15C/min => 170C(8min) => 5C/min => 250C |
Capillary | CP-Sil 8CB-MS | 1387. | Mockute, Bernotiene, et al., 2003, 2 | He; Column length: 50. m; Column diameter: 0.32 mm; Program: 50C(2min) => 3C/min => 180C(1min) => 20C/min => 250C(2min) |
Capillary | CP Sil 8 CB | 1384. | Mockute, Nivinskiene, et al., 2003 | 50. m/0.32 mm/0.25 μm, He; Program: 60C(1min) => 5C/min => 160C => 10C/min => 250C(5min) |
Capillary | DB-1 | 1383. | Silva, Matos, et al., 2003 | 30. m/0.25 mm/0.1 μm, He; Program: 35C => 4C/min => 180C => 10C/min => 250C |
Capillary | DB-5 | 1382.0 | Veres, Varga, et al., 2003 | 30. m/0.25 mm/0.25 μm, He; Program: 60C => 3C/min => 210C => 5C/min => 250C(2min) |
Capillary | CP Sil 8 CB | 1384. | Mockute and Judzentiene, 2002 | He; Column length: 50. m; Column diameter: 0.32 mm; Program: 60C(2min) => 5C/min => 160C(1min) => 10C/min => 250C (2min) |
Capillary | CP Sil 8 CB | 1384. | Mockute and Judzentiene, 2002, 2 | He; Column length: 50. m; Column diameter: 0.32 mm; Program: 60C(2min) => 5C/min => 160C(1min) => 10C/min => 250C(2min) |
Capillary | DB-5 | 1366. | Ferreira, Costantin, et al., 2001 | Program: not specified |
Capillary | DB-1 | 1379. | Figueiredo, Miguel, et al., 2001 | 30. m/0.25 mm/0.25 μm; Program: 45 0C 3 K/min -> 175 0C 15 K/min -> 300 0C (10 min) |
Capillary | DB-1 | 1379. | da Silva, Pedro, et al., 2000 | 30. m/0.25 mm/0.25 μm, H2; Program: 40 0C 3 K/min -> 175 0C 15 K/min -> 240 0C (10 min) |
Capillary | SE-30 | 1406. | Prikhod'ko, Klyuev, et al., 1999 | 30. m/0.25 mm/0.20 μm, Helium; Program: not specified |
Capillary | CP Sil 5 CB | 1396. | Weyerstahl, Marschall, et al., 1999 | He; Column length: 25. m; Column diameter: 0.39 mm; Program: not specified |
Capillary | DB-1 | 1379. | Baratta, Dorman, et al., 1998 | 30. m/0.25 mm/0.25 μm, He; Program: 45C => 3C/min => 175C => 15C/min => 240C (10min) |
Capillary | OV-1 | 1383. | Kökdil, 1998 | 50. m/0.32 mm/0.25 μm, He; Program: 1)50C(1min) => 4C/min => 180C => 2C/min => 250C(10min) 2)50C(1min) => 6C/min => 200C => 12C/min => 250C(5min) |
Capillary | DB-5 | 1382. | Yusuf, Begum, et al., 1998 | 30. m/0.25 mm/0.25 μm, He; Program: 60C => 3C/min => 240C => 30C/min => 300C |
Capillary | SPB-Sulfur | 1385. | Mariaca, Berger, et al., 1997 | 30. m/0.32 mm/4. μm, He; Program: not specified |
Capillary | CP Sil 5 CB | 1385. | Weyerstahl, Marschall, et al., 1997 | N2; Column length: 25. m; Program: not specified |
Capillary | DB-1 | 1379. | Barroso, Figueiredo, et al., 1996 | 30. m/0.25 mm/0.25 μm, H2; Program: 45 0C 3 0C/min -> 175 0C 15 0C/min -> 240 0C (10 min) |
Capillary | Methyl Silicone | 1385. | Zenkevich, 1996 | Program: not specified |
Capillary | DB-1 | 1381. | Binder and Flath, 1989 | Column length: 60. m; Column diameter: 0.32 mm; Program: not specified |
Capillary | DB-1 | 1381. | Miller, Bills, et al., 1989 | 60. m/0.32 mm/0.25 μm, He; Program: -80 C (20 min; during thermal desorption) 50-200 C at 4 C/min 200-320 C at 10 C/min |
Capillary | DB-1 | 1385. | Miller, Bills, et al., 1989 | 60. m/0.32 mm/0.25 μm, He; Program: -80 C (20 min; during thermal desorption) 50-200 C at 4 C/min 200-320 C at 10 C/min |
Capillary | OV-1 | 1381. | De Pooter and Schamp, 1987 | 35. m/0.50 mm/1.5 μm; Program: not specified |
Capillary | OV-101 | 1406. | Shibamoto, 1987 | Program: not specified |

Normal alkane RI, polar column, temperature ramp

Column type | Active phase | I | Reference | Comment |
---|---|---|---|---|
Capillary | RTX-Wax | 1496. | Bendiabdellah, El Amine Dib, et al., 2012 | 60. m/0.22 mm/0.25 μm, Helium, 2. K/min, 230. C @ 5. min; Tstart: 60. C |
Capillary | DB-Wax | 1574. | Niponsak, Laohakunjit, et al., 2011 | 30. m/0.25 mm/0.25 μm, 5. K/min, 240. C @ 5. min; Tstart: 40. C |
Capillary | RTX-Wax | 1520. | Dib, Djabou, et al., 2010 | 60. m/0.22 mm/0.25 μm, Helium, 2. K/min, 230. C @ 30. min; Tstart: 60. C |
Capillary | Supelcowax-10 | 1514. | Neves, Rosa, et al., 2010 | 30. m/0.20 mm/0.20 μm, Helium, 3. K/min, 220. C @ 15. min; Tstart: 70. C |
Capillary | DB-Wax | 1521. | Karlsson, Birgersson, et al., 2009 | 30. m/0.25 mm/0.25 μm, Hydrogen, 30. C @ 5. min, 8. K/min, 230. C @ 10. min |
Capillary | RTX-Wax | 1506. | Museli, Pau, et al., 2009 | 60. m/0.22 mm/0.25 μm, Helium, 2. K/min, 230. C @ 30. min; Tstart: 60. C |
Capillary | DB-Wax | 1528. | Guo, Wu, et al., 2008 | 30. m/0.25 mm/0.25 μm, Helium, 60. C @ 2. min, 10. K/min, 250. C @ 10. min |
Capillary | RTX-Wax | 1519. | Paolini, Tomi, et al., 2008 | 60. m/0.22 mm/0.25 μm, He, 2. K/min, 230. C @ 35. min; Tstart: 60. C |
Capillary | HP Innowax | 1507. | Capetanos, Saroglou, et al., 2007 | 30. m/0.32 mm/0.50 μm, Helium, 3. K/min; Tstart: 60. C; Tend: 260. C |
Capillary | HP-Innowax | 1520. | Cheraif, Ben Jannet, et al., 2007 | 30. m/0.25 mm/0.25 μm, N2, 50. C @ 1. min, 5. K/min, 240. C @ 4. min |
Capillary | HP-Innowax | 1535. | Formisano, Rigano, et al., 2007 | 30. m/0.25 mm/0.25 μm, Helium, 40. C @ 5. min, 2. K/min; Tend: 250. C |
Capillary | TC-FFAP | 1518. | Kurose, Okamura, et al., 2007 | He, 3. K/min, 220. C @ 30. min; Column diameter: 0.25 mm; Phase thickness: 0.25 μm; Tstart: 60. C |
Capillary | Supelcowax-10 | 1514. | Pinto, Salgueiro, et al., 2007 | 30. m/0.2 mm/0.2 μm, He, 3. K/min, 220. C @ 15. min; Tstart: 70. C |
Capillary | Carbowax | 1556. | Singh, Kumar, et al., 2007 | 60. m/0.25 mm/0.25 μm, He, 5. K/min; Tstart: 40. C; Tend: 180. C |
Capillary | Supelcowax-10 | 1521. | Sylvestre, Longtin, et al., 2007 | 30. m/0.25 mm/0.25 μm, 2. K/min, 210. C @ 33. min; Tstart: 40. C |
Capillary | DB-Wax | 1510. | Cai, Lin, et al., 2006 | 60. m/0.25 mm/0.5 μm, He, 50. C @ 2. min, 3. K/min, 230. C @ 20. min |
Capillary | NB-20M | 1500. | Orav, Raal, et al., 2006 | 30. m/0.2 mm/0.25 μm, He, 2. K/min; Tstart: 50. C; Tend: 250. C |
Capillary | HP-20M | 1496. | Bezic, Skocibusic, et al., 2005 | 50. m/0.20 mm/0.20 μm, Helium, 70. C @ 4. min, 4. K/min, 250. C @ 10. min |
Capillary | Stabilwax | 1518. | Jirovetz, Buchbauer, et al., 2005 | 30. m/0.32 mm/0.5 μm, 40. C @ 5. min, 6. K/min, 280. C @ 5. min |
Capillary | HP-20M | 1496. | Kulisic, Radonic, et al., 2005 | 50. m/0.20 mm/0.20 μm, Helium, 70. C @ 4. min, 4. K/min, 180. C @ 10. min |
Capillary | HP-20M | 1496. | Kulisic, Radonic, et al., 2005 | 50. m/0.20 mm/0.20 μm, Helium, 70. C @ 4. min, 4. K/min, 180. C @ 10. min |
Capillary | DB-Wax | 1499. | Salehi, Sonboli, et al., 2005 | 30. m/0.25 mm/0.25 μm, He, 4. K/min, 250. C @ 10. min; Tstart: 40. C |
Capillary | DB-Wax | 1517. | Palá-Paúl, Brophy, et al., 2004 | 60. m/0.32 mm/0.25 μm, He, 3. K/min; Tstart: 35. C; Tend: 220. C |
Capillary | SW-10 | 1510. | Raal, Paaver, et al., 2004 | 50. m/0.20 mm/0.25 μm, He, 2. K/min; Tstart: 50. C; Tend: 230. C |
Capillary | HP-20M | 1497. | Juteau, Jerkovic, et al., 2003 | 50. m/0.2 mm/0.2 μm, He, 70. C @ 4. min, 4. K/min, 180. C @ 10. min |
Capillary | Carbowax 20M | 1512. | Priestap, van Baren, et al., 2003 | 50. m/0.25 mm/0.25 μm, N2, 3. K/min; Tstart: 90. C; Tend: 220. C |
Capillary | HP-Innowax | 1526. | Stashenko, Jaramillo, et al., 2003 | 50. m/0.2 mm/0.2 μm, 50. C @ 5. min, 4. K/min; Tend: 220. C |
Capillary | HP-Innowax | 1526. | Stashenko, Jaramillo, et al., 2003 | 50. m/0.2 mm/0.2 μm, 50. C @ 5. min, 4. K/min; Tend: 220. C |
Capillary | HP-Innowax | 1526. | Stashenko, Jaramillo, et al., 2003 | 50. m/0.2 mm/0.2 μm, 50. C @ 5. min, 4. K/min; Tend: 220. C |
Capillary | Innowax | 1535. | Suleimenov, Atazharova, et al., 2003 | He, 60. C @ 10. min, 4. K/min, 220. C @ 10. min; Column length: 60. m; Column diameter: 0.25 mm |
Capillary | DB-Wax | 1501. | Gancel, Ollé, et al., 2002 | 60. m/0.32 mm/0.25 μm, H2, 1.5 K/min, 245. C @ 20. min; Tstart: 40. C |
Capillary | Carbowax 20M | 1526. | Kasali, Winterhalter, et al., 2002 | 30. m/0.25 mm/0.325 μm, He, 4. K/min, 215. C @ 20. min; Tstart: 50. C |
Capillary | HP-Wax | 1535. | Priestap, van Baren, et al., 2002 | 50. m/0.25 mm/0.25 μm, N2, 75. C @ 4. min, 3. K/min; Tend: 220. C |
Capillary | Innowax | 1535. | Baser, Özek, et al., 2000 | 60. m/0.25 mm/0.25 μm, He, 60. C @ 10. min, 4. K/min, 220. C @ 10. min |
Capillary | DB-Wax | 1516. | Buttery, Light, et al., 2000 | 60. m/0.25 mm/0.25 μm, 30. C @ 4. min, 2. K/min, 170. C @ 30. min |
Capillary | CP-Wax 52CB | 1530. | Chagonda, Makanda, et al., 2000, 2 | 50. m/0.30 mm/0.25 μm, He, 40. C @ 5. min, 3. K/min; Tend: 220. C |
Capillary | HP Innowax FSP | 1535. | Kaya, Baser, et al., 1999 | 60. m/0.25 mm/0.25 μm, He, 60. C @ 10. min, 220. C @ 10. min |
Capillary | Innowax | 1529. | Kaya, Baser, et al., 1999, 2 | 60. m/0.25 mm/0.25 μm, He, 60. C @ 10. min; Tend: 220. C |
Capillary | HP-Innowax | 1529. | Kaya, Baser, et al., 1999, 3 | 60. m/0.25 mm/0.25 μm, He, 60. C @ 10. min; Tend: 220. C |
Capillary | HP-Innowax | 1529. | Kaya, Baser, et al., 1999, 3 | 60. m/0.25 mm/0.25 μm, He, 60. C @ 10. min; Tend: 220. C |
Capillary | HP-Innowax | 1529. | Kaya, Baser, et al., 1999, 3 | 60. m/0.25 mm/0.25 μm, He, 60. C @ 10. min; Tend: 220. C |
Capillary | Carbowax | 1546. | Menon, Chacko, et al., 1999 | N2, 1. K/min, 200. C @ 20. min; Column length: 50. m; Column diameter: 0.2 mm; Tstart: 80. C |
Capillary | NB-351 | 1527. | Onocha, Ekundayo, et al., 1999 | 25. m/0.3 mm/0.5 μm, H2, 70. C @ 2. min, 5. K/min; Tend: 250. C |
Capillary | HP-20M | 1530. | Prikhod'ko, Klyuev, et al., 1999 | 25. m/0.20 mm/0.25 μm, Helium, 60. C @ 4. min, 3. K/min; Tend: 200. C |
Capillary | DB-Wax | 1537. | Molleken U., Sinnwell V., et al., 1998 | 30. m/0.25 mm/0.25 μm, N2, 3. K/min; Tstart: 45. C; Tend: 220. C |
Capillary | DB-Wax | 1527. | Mölleken, Sinnwell, et al., 1998 | 30. m/0.25 mm/0.25 μm, N2, 3. K/min; Tstart: 45. C; Tend: 220. C |
Capillary | HP-Innowax FSC | 1535. | Tümen, Baser, et al., 1998 | 60. m/0.25 mm/0.25 μm, He, 60. C @ 10. min, 4. K/min, 220. C @ 10. min |
Capillary | HP-Innowax FSC | 1535. | Baser, Kirimer, et al., 1997 | He, 60. C @ 10. min, 4. K/min, 240. C @ 10. min; Column length: 60. m; Column diameter: 0.25 mm |
Capillary | Supelcowax-10 | 1516. | Zygadlo, Ariza-Espinar, et al., 1997 | He, 3. K/min; Column length: 0. m; Column diameter: 0.25 mm; Tstart: 40. C; Tend: 240. C |
Capillary | DB-Wax | 1506. | Pollak and Berger, 1996 | 30. m/0.32 mm/0.5 μm, He, 40. C @ 1. min, 3. K/min, 210. C @ 25. min |
Capillary | DB-Wax | 1546. | Sagrero-Nieves and Bartley, 1996 | 60. m/0.32 mm/0.50 μm, He, 50. C @ 1. min, 8. K/min, 250. C @ 6. min |
Capillary | DB-Wax | 1518. | Binder, Turner, et al., 1990 | 4. K/min, 230. C @ 10. min; Column length: 60. m; Column diameter: 0.32 mm; Tstart: 50. C |
Capillary | DB-Wax | 1518. | Binder, Turner, et al., 1990, 2 | 4. K/min, 230. C @ 10. min; Column length: 60. m; Column diameter: 0.32 mm; Tstart: 50. C |
Capillary | DB-Wax | 1515. | Binder and Flath, 1989 | 50. C @ 0.1 min, 4. K/min, 250. C @ 5. min; Column length: 60. m; Column diameter: 0.32 mm |
Capillary | Carbowax 20M | 1517. | Gaydou, Faure, et al., 1989 | 50. m/0.32 mm/0.15 μm, H2, 2. K/min; Tstart: 70. C; Tend: 210. C |
Capillary | Supelcowax-10 | 1526. | Ramaswami, Briscese, et al., 1988 | 50. C @ 2. min, 4. K/min, 240. C @ 10. min; Column length: 30. m |
Capillary | Supelcowax-10 | 1526. | Ramaswami, Briscese, et al., 1986 | He, 50. C @ 2. min, 4. K/min, 240. C @ 10. min; Column length: 30. m |

Normal alkane RI, polar column, custom temperature program

Column type | Active phase | I | Reference | Comment |
---|---|---|---|---|
Capillary | Innowax FSC | 1535. | Akin, Saracoglu, et al., 2012 | 60. m/0.25 mm/0.25 μm, Helium; Program: 60 0C (10 min) 4 0C/min -> 220 0C (10 min) 1 oC/min -> 240 0C |
Capillary | Innowax FSC | 1535. | Bardakci, Demirci, et al., 2012 | 60. m/0.25 mm/0.25 μm, Helium; Program: 60 0C (10 min) 4 0C/min -> 220 0C 1 0C/min -> 240 0C |
Capillary | Innowax | 1535. | Noorizadeh, Farmany, et al., 2011 | 60. m/0.25 mm/0.33 μm; Program: not specified |
Capillary | HP Innowax | 1535. | Noorizadeh and Farmany, 2010 | 60. m/0.25 mm/0.33 μm; Program: not specified |
Capillary | HP Innowax | 1535. | Mancini, Arnold, et al., 2009 | 50. m/0.20 mm/0.25 μm, Helium; Program: 40 0C (5 min) 2 0C/min -> 270 0C -> 260 0C (20 min) |
Capillary | HP-Innowax | 1535. | Formisano, Mignola, et al., 2007 | 50. m/0.2 mm/0.2 μm, He; Program: 40C(5min) => 2C/min => 250C(15min) => 10C/min => 270C |
Capillary | Innowax FSC | 1535. | Kaya, Benirci, et al., 2007 | 60. m/0.25 mm/0.25 μm, Nitrogen; Program: 60 0C (10 min) 1 0C/min -> 220 0C (10 min) 1 0C/min -> 240 0C |
Capillary | AquaWax | 1540. | Liolios, Laouer, et al., 2007 | Program: not specified |
Capillary | DB-Wax | 1510. | Wenguang, Wenlai, et al., 2007 | 30. m/0.25 mm/0.25 μm; Program: 40 0C (3 min) 3 0C/min -> 150 0C (2 min) 6 0C/min -> 230 0C (10 min) |
Capillary | Innowax FSC | 1532. | Baser K.H.C., Ozek G., et al., 2006 | 60. m/0.25 mm/0.25 μm, He; Program: 60C(10min) => 4C/min => 220C (10min) => 1C/min => 240C |
Capillary | Innowax FSC | 1535. | Baser, Özek, et al., 2006 | 60. m/0.25 mm/0.25 μm, He; Program: 60C(10min) => 4C/min >220C (10min) => 1C/min => 240C |
Capillary | Innowax FSC | 1535. | Baser, Özek, et al., 2006 | 60. m/0.25 mm/0.25 μm, He; Program: 60C(10min) => 4C/min >220C (10min) => 1C/min => 240C |
Capillary | HP-Innowax FSC | 1535. | Erdurak, Coskun, et al., 2006 | 60. m/0.25 mm/0.25 μm, He; Program: 60C(10min) => 4C/min => 220C (10min) => 1C/min => 240C |
Capillary | HP-Innowax FSC | 1535. | Tabanca, Demirci, et al., 2006 | 60. m/0.25 mm/0.25 μm; Program: 60C(10min) => 4C/min => 220C (10min) => 1C/min => 240C |
Capillary | HP-Innowax FSC | 1535. | Demirci, Demirci, et al., 2005 | 60. m/0.25 mm/0.25 μm, N2; Program: 60C(10min) => 4C/min => 220C (10min) => 1C/min => 240C |
Capillary | HP-Innowax | 1535. | Duman, Kartal, et al., 2005 | 60. m/0.25 mm/0.25 μm, N2; Program: 60C(10min) => 4C/min => 220C(10min) => 1C/min => 240C |
Capillary | DB-Wax | 1515. | Pala-Paul, Perez-Alonso, et al., 2005 | N2; Program: not specified |
Capillary | HP-Innowax FSC | 1535. | Sezik E., Kocakulak E., et al., 2005 | 60. m/0.25 mm/0.25 μm, He; Program: 60C(10min) => 4C/min => 220C(10min) => 1C/min => 240C |
Capillary | HP-Innowax FSC | 1535. | Tabanca, Demirci, et al., 2005 | 60. m/0.25 mm/0.25 μm, He; Program: 60C(10min) => 4C/min => 220C(10min) => 1C/min => 240C |
Capillary | HP-Innowax FSC | 1535. | Viljoen, Subramoney, et al., 2005 | 60. m/0.25 mm/0.25 μm, He; Program: 60C(10min) => 4C/min => 220C(10min) => 1C/min => 240C |
Capillary | HP Innowax FSP | 1535. | Altintas, Kose, et al., 2004 | 60. m/0.25 mm/0.25 μm, N2; Program: 60C(10min) => 4C/min => 220C(10min) => 1C/min => 240C |
Capillary | HP-Innowax FSC | 1535. | Demirci, Paper, et al., 2004 | 60. m/0.25 mm/0.25 μm, N2; Program: 60C(10min) => 4C/min => 220C(10min) => 1C/min => 240C |
Capillary | HP-Innowax FSC | 1535. | Kivcak, Akay, et al., 2004 | 60. m/0.25 mm/0.25 μm, He; Program: 60C(10min) => 4C/min => 220C(10min) => 1C/min => 240C |
Capillary | HP-Innowax FSC | 1535. | Kivcak, Akay, et al., 2004 | 60. m/0.25 mm/0.25 μm, He; Program: 60C(10min) => 4C/min => 220C(10min) => 1C/min => 240C |
Capillary | HP-Innowax | 1535. | Senatore, Apostolides Arnold, et al., 2004 | 50. m/0.2 mm/0.2 μm; Program: not specified |
Capillary | Carbowax 20M | 1540. | Vinogradov, 2004 | Program: not specified |
Capillary | Innowax FSC | 1535. | Baser, Demirci, et al., 2003 | 60. m/0.25 mm/0.25 μm, He; Program: 60C(10min) => 4C/min => 220C (10min) => 1C/min => 240C |
Capillary | HP-Innowax FSC | 1535. | Demirci, Baser, et al., 2003 | 60. m/0.25 mm/0.25 μm, He; Program: 60C (10min) => 4C/min => 220C (10min) => 1C/min => 240C |
Capillary | HP-Innowax FSC | 1535. | Demirci, Dadandi, et al., 2003 | 60. m/0.25 mm/0.25 μm, He; Program: 60C(10min) => 4C/min => 220C(10min) => 1C/min => 240C |
Capillary | HP-Innowax | 1535. | Baser, Demirci, et al., 2002 | 60. m/0.25 mm/0.25 μm, He; Program: 60 0C (10 min) 4 K/min -> 220 0C (10 min) 1 K/min -> 240 0C |
Capillary | Innowax FSC | 1535. | Baser, Demirei, et al., 2002 | 60. m/0.25 mm/0.25 μm, He; Program: 60C(10min) => 4C/min => 220C(10min) => 1C/min => 240C |
Capillary | HP-Innowax FSC | 1535. | Kaya, Demirci, et al., 2001 | 60. m/0.25 mm/0.25 μm; Program: 60C(10min) => 4C/min => 220C(10min) => 1C/min => 240C |
Capillary | HP-Innowax FSC | 1535. | Kirimer N., Tabanea N., et al., 2001 | 60. m/0.25 mm/0.25 μm, He; Program: 60C(10min) => 4C/min => 220C(10min) => 1C/min => 240C |
Capillary | Innowax FSC | 1535. | Saglam, Gozler, et al., 2001 | 60. m/0.25 mm/0.25 μm, He; Program: 60C(10min) => 4C/min => 220C(10min) => 1C/min => 240C |
Capillary | Innowax FSC | 1535. | Tabanca N., Demirci F., et al., 2001 | 60. m/0.25 mm/0.25 μm, He; Program: 60C(10min) => 4C/min => 220C(10min) => 1C/min => 240C |
Capillary | HP-Innowax FSC | 1535. | Tabanca, Kirimer, et al., 2001 | 60. m/0.25 mm/0.25 μm; Program: 60C(10min) => 4C/min => 220C(10min) => 1C/min => 240C |
Capillary | Innowax | 1535. | Ahmed, Choudhary, et al., 2000 | He; Column length: 60. m; Column diameter: 0.25 mm; Program: 60 0C (10 min) 4 K/min -> 220 0C (10 min) 1 K/min -> 240 0C |
Capillary | Innowax | 1535. | Baser, Özek, et al., 2000, 2 | 60. m/0.25 mm/0.25 μm, He; Program: 60 0C (10 min) 4 K/min -> 220 0C (10 min) 1 K/min -> 240 0C |
Capillary | Innowax | 1535. | Baser, Tabanca, et al., 2000 | 60. m/0.25 mm/0.25 μm, He; Program: 60 0C (10 min) 4 K/min -> 220 0C (10 min) 1 K/min -> 240 0C |
Capillary | Innowax FSC | 1535. | Kirimer, Tabanca, et al., 2000 | 60. m/0.25 mm/0.25 μm, He; Program: 60C(10 min) => 4C/min => 220C(10min) => 1C/min => 240C |
Capillary | Innowax FSC | 1535. | Kirimer, Tabanca, et al., 1999 | 60. m/0.25 mm/0.25 μm, Helium; Program: 60 0C (10 min) 4 0C/min -> 220 0C (10 min) 1 0C/min -> 240 0C |
Capillary | CP-Wax 52CB | 1515. | Vernin, 1991 | Column length: 50. m; Column diameter: 0.32 mm; Program: not specified |
Capillary | DB-Wax | 1518. | Binder and Flath, 1989 | Column length: 60. m; Column diameter: 0.32 mm; Program: not specified |
Capillary | Carbowax 20M | 1546. | Shibamoto, 1987 | Program: not specified |
Capillary | Carbowax 400, Carbowax 20M, Carbowax 1540, Carbowax 4000, Superox 06, PEG 20M, etc. | 1490. | Waggott and Davies, 1984 | Hydrogen; Column length: 50. m; Column diameter: 0.32 mm; Program: not specified |

References

Andersen, Bissonette, et al., 1977
Andersen, N.H.; Bissonette, P.; Liu, C.-B.; Shunk, B.; Ohta, Y.; Tseng, C.-L.W.; Moore, A.; Huneck, S.,
Sesquiterpenes of nine European liverworts from the genera, Anastrepta, Bazzania, Jungermannia, Lepidozia, and Scapania,
Phytochemistry, 1977, 16, 11, 1731-1751, https://doi.org/10.1016/0031-9422(71)85081-1
. [all data]
Andersen and Falcone, 1969
Andersen, N.H.; Falcone, M.S.,
The identification of sesquiterpene hydrocarbons from gas-liquid chromatography retention data,
J. Chromatogr., 1969, 44, 52-59, https://doi.org/10.1016/S0021-9673(01)92497-5
. [all data]
Hazzit, Baaliouamer, et al., 2006
Hazzit, M.; Baaliouamer, A.; Faleiro, M.L.; Miguel, M.G.,
Composition of the Essential Oils of Thymus and Origanum Species from Algeria and Their Antioxidant and Antimicrobial Activities,
J. Agric. Food Chem., 2006, 54, 17, 6314-6321, https://doi.org/10.1021/jf0606104
. [all data]
Jalali-Heravi, Zekavat, et al., 2006
Jalali-Heravi, M.; Zekavat, B.; Sereshti, H.,
Characterization of essential oil components of Iranian geranium oil using gas chromatography-mass spectrometry combined with chemometric resolution techniques,
J. Chromatogr. A, 2006, 1114, 1, 154-163, https://doi.org/10.1016/j.chroma.2006.02.034
. [all data]
Lucero, Fredrickson, et al., 2006
Lucero, M.E.; Fredrickson, E.L.; Estell, R.E.; Morrison, A.A.; Richman, D.B.,
Volatile Composition of Gutierrezia sarothrae (Broom Snakeweed) as Determined by Steam Distillation and Solid Phase Microextraction,
J. Essent. Oil Res., 2006, 18, 2, 121-125, https://doi.org/10.1080/10412905.2006.9699039
. [all data]
Meccia G., Rosquete C., et al., 2006
Meccia G.; Rosquete C.; Rojas L.B.; San Felician A.,
New labdane derivative from the essential oil of Acalypha plicata Mull.Arg.,
Flavour Fragr. J., 2006, 21, 3, 559-561, https://doi.org/10.1002/ffj.1679
. [all data]
Mevy, Bessiere, et al., 2006
Mevy, J.P.; Bessiere, J.M.; Rabier, J.; Dherbomez, M.; Ruzzier, M.; Millogo, J.; Viano, J.,
Composition and antimicrobial activities of the essential oil of Triumfetta rhomboidea Jacq.,
Flavour Fragr. J., 2006, 21, 1, 80-83, https://doi.org/10.1002/ffj.1511
. [all data]
Sylvestre, Pichette, et al., 2006
Sylvestre, M.; Pichette, A.; Longtin, A.; Nagau, F.; Legault, J.,
Essential oil analysis and anticancer activity of leaf essential oil of Croton flavens L. from Guadeloupe,
J. Ethnopharmacol., 2006, 103, 1, 99-102, https://doi.org/10.1016/j.jep.2005.07.011
. [all data]
Adams, Morris, et al., 2005
Adams, R.P.; Morris, J.A.; Pandey, R.N.; Schwarzbach, A.E.,
Cryptic speciation between Juniperus deltoides and Juniperus oxycedrus (Cupressaceae) in the Mediterranean,
Biochem. Syst. Ecol., 2005, 33, 8, 771-787, https://doi.org/10.1016/j.bse.2005.01.001
. [all data]
Adams and Nguyen, 2005
Adams, R.P.; Nguyen, S.,
Infra-specific variation in Juniperus deppeana and F. Sperryi in the Davis Mountains of Texas: variation in leaf essential oils and random amplified polymorphic DNAS (RAPDS),
Phytologia, 2005, 87, 2, 96-108. [all data]
Asuming, Beauchamp, et al., 2005
Asuming, W.A.; Beauchamp, P.S.; Descalzo, J.T.; Dev, B.C.; Dev, V.; Frost, S.; Ma, C.W.,
Essential oil composition of four Lomatium Raf. species and their chemotaxonomy,
Biochem. Syst. Ecol., 2005, 33, 1, 17-26, https://doi.org/10.1016/j.bse.2004.06.005
. [all data]
Tepe, Sokmen, et al., 2005
Tepe, B.; Sokmen, M.; Sokmen, A.; Daferera, D.; Polissiou, M.,
Antimicrobial and antioxidative activity of the essential oil and various extracts of Cyclotrichium origanifolium (Labill.) Manden. Scheng.,
J. Food Eng., 2005, 69, 3, 335-342, https://doi.org/10.1016/j.jfoodeng.2004.08.024
. [all data]
Gauvin, Lecomte, et al., 2004
Gauvin, A.; Lecomte, H.; Smadja, J.,
Comparative investigations of the essential oils of two scented geranium (Pelargonium spp.) cultivars grown on Reunion Island,
Flavour Fragr. J., 2004, 19, 5, 455-460, https://doi.org/10.1002/ffj.1354
. [all data]
Juliani, Zygadlo, et al., 2004
Juliani, H.R.; Zygadlo, J.A.; Scrivanti, R.; de la Sota, E.; Simon, J.E.,
The essential oil of Anemia tomentosa (Savigny) Sw. var. anthriscifolia (Schrad.) Mickel,
Flavour Fragr. J., 2004, 19, 6, 541-543, https://doi.org/10.1002/ffj.1341
. [all data]
Lopes, Strobl, et al., 2004
Lopes, D.; Strobl, H.; Kolodziejczyk, P.,
14-Methylpentadecano-15-lactone (Muscolide): a new macrocyclic lactone from the oil of Angelica archangelica L.,
Chemistry and Biodiversity, 2004, 1, 12, 1880-1887, https://doi.org/10.1002/cbdv.200490144
. [all data]
Morteza-Semnani, Azadbakht, et al., 2004
Morteza-Semnani, K.; Azadbakht, M.; Goodarzi, A.,
The essential oils composition of Phlomis herba-venti L. leaves and flowers of Iranian origin,
Flavour Fragr. J., 2004, 19, 1, 29-31, https://doi.org/10.1002/ffj.1268
. [all data]
Palmeira, Moura, et al., 2004
Palmeira, S.F., Jr.; Moura, F.S.; Alves, V.L.; de Oliveira, F.M.; Bento, E.S.; Conserva, L.M.; Andrade, E.H.A.,
Neutral components from hexane extracts of Croton sellowii,
Flavour Fragr. J., 2004, 19, 1, 69-71, https://doi.org/10.1002/ffj.1298
. [all data]
Santos, Lopes, et al., 2004
Santos, A.P.; Lopes, M.C.; Limberger, R.P.; Apel, M.A.; Henriques, A.T.; Moreno, P.R.H.,
Analysis of the volatile oil from Pilocarpus pennatifolius Lemmaire (Rutaceae) leaves by GC-MS,
Flavour Fragr. J., 2004, 19, 4, 325-326, https://doi.org/10.1002/ffj.1306
. [all data]
Schwob, Bessiere, et al., 2004
Schwob, I.; Bessiere, J.-M.; Masotti, V.; Viano, J.,
Changes in essential oil composition in Saint John's wort (Hypericum perforatum L.) aerial parts during its phenological cycle,
Biochem. Syst. Ecol., 2004, 32, 8, 735-745, https://doi.org/10.1016/j.bse.2003.12.005
. [all data]
Siani, Garrido, et al., 2004
Siani, A.C.; Garrido, I.S.; Monteiro, S.S.; Carvalho, E.S.; Ramos, M.F.S.,
Protium icicariba as a source of volatile essences,
Biochem. Syst. Ecol., 2004, 32, 5, 477-489, https://doi.org/10.1016/j.bse.2003.11.003
. [all data]
Velasco-Negueruela, Sanz, et al., 2004
Velasco-Negueruela, A.; Sanz, J.; Pérez-Alonso, M.J.; Palá-Paúl, J.,
The volatile components of the aerial parts of Melittis melissophyllum L. subsp. melissophyllum gathered in Spain,
Botanica Complutensis, 2004, 28, 133-136. [all data]
Amparo Blázquez, Pérez, et al., 2003
Amparo Blázquez, M.; Pérez, I.; Boira, H.,
Essential oil analysis of Teucrium libanitis and T. turredanum by GC and GC-MS,
Flavour Fragr. J., 2003, 18, 6, 497-501, https://doi.org/10.1002/ffj.1256
. [all data]
Baranauskiene, Venskutonis, et al., 2003
Baranauskiene, R.; Venskutonis, P.R.; Viskelis, P.; Dambrauskiene, E.,
Influence of nitrogen fertilizers on the yield and composition of thyme (Thymus vulgaris),
J. Agric. Food Chem., 2003, 51, 26, 7751-7758, https://doi.org/10.1021/jf0303316
. [all data]
Lucero, Estell, et al., 2003
Lucero, M.E.; Estell, R.E.; Frederickson, E.L.,
The essential oil composition of Psorothamnus scoparius (A. Gray) Rydb.,
J. Essent. Oil Res., 2003, 15, 2, 108-111, https://doi.org/10.1080/10412905.2003.9712083
. [all data]
Özcan, Tzakou, et al., 2003
Özcan, M.; Tzakou, O.; Couladis, M.,
Essential oil composition of Turkish herbal tea (Salvia aucheri Bentham var. canescens Boiss. Heldr.),
Flavour Fragr. J., 2003, 18, 4, 325-327, https://doi.org/10.1002/ffj.1229
. [all data]
Buchin, Salmon, et al., 2002
Buchin, S.; Salmon, J.-C.; Carnat, A.-P.; Berger, T.; Bugaud, C.; Bosset, J.O.,
Identification de composés monoterpéniques, sesquiterpéniques et benzéniques dans un lait d'alpage très riche en ces substances,
Mitt. Lebensmittelunters. Hyg., 2002, 93, 199-216. [all data]
Palá-Paúl, Velasco-Negueruela, et al., 2002
Palá-Paúl, J.; Velasco-Negueruela, A.; Pérez-Alonso, M.J.; Sanz, J.,
Essential oil composition of the aerial parts of Cachrys sicula L.,
Flavour Fragr. J., 2002, 17, 1, 64-68, https://doi.org/10.1002/ffj.1042
. [all data]
Rajeswara Rao, Kaul, et al., 2002
Rajeswara Rao, B.R.; Kaul, P.N.; Syamasundar, K.V.; Ramesh, S.,
Water soluble fractions of rose scented geranium (Pelargonium species) essential oil,
Bioresour. Technol., 2002, 84, 3, 243-246, https://doi.org/10.1016/S0960-8524(02)00057-3
. [all data]
Salido, Altarejos, et al., 2002
Salido, S.; Altarejos, J.; Nogueras, M.; Sánchez, A.; Pannecouque, C.; Witvrouw, M.; De Clercq, E.,
Chemical studies of essential oils of Juniperus oxycedrus ssp. badia,
J. Ethnopharmacol., 2002, 81, 1, 129-134, https://doi.org/10.1016/S0378-8741(02)00045-4
. [all data]
Gudzic, Dordevic, et al., 2001
Gudzic, B.; Dordevic, S.; Palic, R.; Stojanovic, G.,
Essential oils of Hypericum olympicum L. and Hypericum perforatum L.,
Flavour Fragr. J., 2001, 16, 3, 201-203, https://doi.org/10.1002/ffj.978
. [all data]
Jain, Aggarwal, et al., 2001
Jain, N.; Aggarwal, K.K.; Syamasundar, K.V.; Srivastava, S.K.; Kumar, S.,
Essential oil composition of geranium (Pelargonium sp.) from the plains of Northern India,
Flavour Fragr. J., 2001, 16, 1, 44-46, https://doi.org/10.1002/1099-1026(200101/02)16:1<44::AID-FFJ943>3.0.CO;2-X
. [all data]
Kitic, Palic, et al., 2001
Kitic, D.; Palic, R.; Ristic, M.; Sojanovic, G.; Jovanovic, T.,
The volatile constituents of Calamintha sylvatica Bromf. subsp. sylvatica,
Flavour Fragr. J., 2001, 16, 4, 257-258, https://doi.org/10.1002/ffj.995
. [all data]
Tzakou and Couladis, 2001
Tzakou, O.; Couladis, M.,
The essential oil of Micromeria graeca (L.) Bentham et Reichenb. growing in Greece,
Flavour Fragr. J., 2001, 16, 2, 107-109, https://doi.org/10.1002/ffj.955
. [all data]
Adams, 2000
Adams, R.P.,
Systematics of Juniperus section Juniperus based on leaf essential oils and random amplified polymorphic DNAs (RAPDs),
Biochem. Syst. Ecol., 2000, 28, 6, 515-528, https://doi.org/10.1016/S0305-1978(99)00089-7
. [all data]
Adams, 2000, 2
Adams, R.P.,
The serrate leaf margined Juniperus (Section Sabina) of the western hemisphere: systematics and evolution based on leaf essential oils and Random Amplified Polymorphic DNAs (RAPDs),
Biochem. Syst. Ecol., 2000, 28, 10, 975-989, https://doi.org/10.1016/S0305-1978(00)00022-3
. [all data]
Kardali, Velasco-Negueruela, et al., 2000
Kardali, M.; Velasco-Negueruela, A.; Pérez-Alonso, M.,
Essential Oil Constituents of Sideritis ibanyezii Pau,
Botanica Complutensis, 2000, 24, 101-106. [all data]
Rao, Kaul, et al., 2000
Rao, B.R.R.; Kaul, P.N.; Mallavarapu, G.R.; Ramesh, S.,
First observation of little leaf disease and its impact on the yield and composition of the essential oil of rose-scented geranium (Pelargonium sp.),
Flavour Fragr. J., 2000, 15, 3, 137-140, https://doi.org/10.1002/1099-1026(200005/06)15:3<137::AID-FFJ880>3.0.CO;2-A
. [all data]
Rao, Rout, et al., 2000
Rao, Y.R.; Rout, P.K.; Jena, K.S.; Sahu, S.B.,
Composition of essential oil of citronella (Cymbopogon winterianus jowitt) grown in coastal Orissa,
Fafai J., 2000, 2, 4, 29-31. [all data]
Rao, Sastry, et al., 2000
Rao, B.R.R.; Sastry, K.P.; Saleem, S.M.; Rao, E.V.S.P.; Syamasundar, K.V.; Ramesh, S.,
Volatile flower oils of three genotypes of rose-scented geranium (Pelargonium sp.),
Flavour Fragr. J., 2000, 15, 2, 105-107, https://doi.org/10.1002/(SICI)1099-1026(200003/04)15:2<105::AID-FFJ875>3.0.CO;2-G
. [all data]
Tzakou, Harvala, et al., 2000
Tzakou, O.; Harvala, C.; Galati, E.M.; Sanogo, R.,
Essential oil composition of Nepeta argolica Borey et Chaub. subsp. argolica,
Flavour Fragr. J., 2000, 15, 2, 115-118, https://doi.org/10.1002/(SICI)1099-1026(200003/04)15:2<115::AID-FFJ877>3.0.CO;2-9
. [all data]
Adams, 1999
Adams, R.P.,
Systematics of multi-seeded eastern hemisphere Juniperus based on leaf essential oils and RAPD DNA fingerprinting,
Biochem. Syst. Ecol., 1999, 27, 7, 709-725, https://doi.org/10.1016/S0305-1978(99)00016-2
. [all data]
Siani, Ramos, et al., 1999
Siani, A.C.; Ramos, M.F.S.; Menezes-de-Lima, O., Jr.; Ribeiro-dos-Santos, R.; Fernadez-Ferreira, E.; Soares, R.O.A.; Rosas, E.C.; Susunaga, G.S.; Guimarães, A.C.; Zoghbi, M.G.B.; Henriques, M.G.M.O.,
Evaluation of anti-inflammatory-related activity of essential oils from the leaves and resin of species of Protium,
J. Ethnopharmacol., 1999, 66, 1, 57-69, https://doi.org/10.1016/S0378-8741(98)00148-2
. [all data]
da Silva, Andrade, et al., 1999
da Silva, M.H.L.; Andrade, E.H.A.; Zoghbi, M.G.B.; Luz, A.I.R.; da Silva, J.D.; Maia, J.G.S.,
The essential oils of Lantana camara L. occurring in North Brazil,
Flavour Fragr. J., 1999, 14, 4, 208-210, https://doi.org/10.1002/(SICI)1099-1026(199907/08)14:4<208::AID-FFJ811>3.0.CO;2-F
. [all data]
da Silva, Zoghbi, et al., 1999
da Silva, M.H.L.; Zoghbi, M.G.B.; Andrade, E.H.A.; Maia, J.G.S.,
The essential oils of Peperomia pellucida Kunth and P. circinnata link var. circinnata,
Flavour Fragr. J., 1999, 14, 5, 312-314, https://doi.org/10.1002/(SICI)1099-1026(199909/10)14:5<312::AID-FFJ835>3.0.CO;2-B
. [all data]
Kaul and Vats, 1998
Kaul, V.K.; Vats, S.K.,
Essential oil composition of Bothriochloa pertusa and phyletic relationship in aromatic grasses,
Biochem. Syst. Ecol., 1998, 26, 3, 347-356, https://doi.org/10.1016/S0305-1978(97)00103-8
. [all data]
Kulkarni, Mallavarapu, et al., 1998
Kulkarni, R.N.; Mallavarapu, G.R.; Baskaran, K.; Ramesch, S.; Kumar, S.,
Composition of the essential oils of two isomenthone-rich variants of geranium (Pelargonium sp.),
Flavour Fragr. J., 1998, 13, 6, 389-392, https://doi.org/10.1002/(SICI)1099-1026(199811/12)13:6<389::AID-FFJ757>3.0.CO;2-2
. [all data]
Senatore, Urrunaga Soria, et al., 1998
Senatore, F.; Urrunaga Soria, E.; Urrunaga Soria, R.; Porta, G.D.; de Feo, V.,
Essential oil from two peruvian Satureja species,
Flavour Fragr. J., 1998, 13, 1, 1-4, https://doi.org/10.1002/(SICI)1099-1026(199801/02)13:1<1::AID-FFJ672>3.0.CO;2-4
. [all data]
Senatore, 1998
Senatore, F.,
Volatile constituents of Minthostachys setosa (Briq.) Epl. (Lamiaceae) from Peru,
Flavour Fragr. J., 1998, 13, 4, 263-265, https://doi.org/10.1002/(SICI)1099-1026(1998070)13:4<263::AID-FFJ738>3.0.CO;2-H
. [all data]
Zoghbi, Andrade, et al., 1998
Zoghbi, M.G.B.; Andrade, E.H.A.; Santos, A.S.; Silva, M.H.L.; Maia, J.G.S.,
Essential oils of Lippia alba (Mill.) N. E. Br growing wild in the Brazilian Amazon,
Flavour Fragr. J., 1998, 13, 1, 47-48, https://doi.org/10.1002/(SICI)1099-1026(199801/02)13:1<47::AID-FFJ690>3.0.CO;2-0
. [all data]
Senatore, Urrunaga Soria, et al., 1997
Senatore, F.; Urrunaga Soria, E.; Urrunaga Soria, R.; Porta, G.D.; Taddeo, R.; de Feo, V.,
Essential oil of Eremocharis triradiata (Wolff.) Johnston (Apiaceae) growing wild in Perú,
Flavour Fragr. J., 1997, 12, 4, 257-259, https://doi.org/10.1002/(SICI)1099-1026(199707)12:4<257::AID-FFJ645>3.0.CO;2-4
. [all data]
Saad, El-Sharkawy, et al., 1995
Saad, H.-E.A.; El-Sharkawy, S.H.; Halim, A.F.,
Essential oils of Daucus carota ssp. maximus,
Pharm. Acta Helv., 1995, 70, 1, 79-84, https://doi.org/10.1016/0031-6865(94)00054-Y
. [all data]
Shellie and Marriott, 2003
Shellie, R.A.; Marriott, P.J.,
Comprehensive two-dimensional gas chromatography-mass spectrometry analysis of Pelargonium graveolens essential oil using rapid scanning quadrupole mass spectrometry,
Analyst, 2003, 128, 7, 879-883, https://doi.org/10.1039/b304371a
. [all data]
Frizzo, Serafini, et al., 2001
Frizzo, C.D.; Serafini, L.A.; Dellacassa, E.; Lorenzo, D.; Moyna, P.,
Essential oil of Baccharis uncinella DC. from Southern Brazil,
Flavour Fragr. J., 2001, 16, 4, 286-288, https://doi.org/10.1002/ffj.998
. [all data]
Adams, 1998
Adams, R.P.,
The essential oils and chemotaxonomy of Juniperus sect. Juniperus,
Biochem. Syst. Ecol., 1998, 26, 6, 637-645, https://doi.org/10.1016/S0305-1978(98)00020-9
. [all data]
Malingré and Maarse, 1974
Malingré, T.M.; Maarse, H.,
Composition of the essential oil of Mentha aquatica,
Phytochemistry, 1974, 13, 8, 1531-1535, https://doi.org/10.1016/0031-9422(74)80322-5
. [all data]
Loayza, Abujder, et al., 1995
Loayza, I.; Abujder, D.; Aranda, R.; Jakupovic, J.; Collin, G.; Deslauriers, H.; Jean, F.-I.,
Essential oils of Baccharis salicifolia, B. latifolia and B. dracunculifolia,
Phytochemistry, 1995, 38, 2, 381-389, https://doi.org/10.1016/0031-9422(94)00628-7
. [all data]
Benzo, Gilardoni, et al., 2007
Benzo, M.; Gilardoni, G.; Gandini, C.; Caccialanza, G.; Finzi, P.V.; Vidari, G.; Abdo, S.; Layedra, P.,
Determination of the threshold odor concentration of main odorants in essential oils using gas chromatography-olfactometry incremental dilution technique,
J. Chromatogr. A, 2007, 1150, 1-2, 131-135, https://doi.org/10.1016/j.chroma.2007.02.031
. [all data]
Cunicao, Lopes, et al., 2007
Cunicao, M.M.; Lopes, A.R.; Côcco, L.C.; Yamamoto, C.I.; Plocharski, R.C.B.; Miguel, M.D.; Junior, A.G.; Auer, C.G.; Miguel, O.G.,
Phytochemical and antibacterial evaluation of essential oils from Ottonia Martiana Miq. (Piperaceae),
J. Braz. Chem. Soc., 2007, 18, 1, 184-188, https://doi.org/10.1590/S0103-50532007000100021
. [all data]
Dehghan, Solaimanian, et al., 2007
Dehghan, G.; Solaimanian, R.; Shahverdi, A.R.; Amin, G.; Abdollahi, M.; Shafiee, A.,
Chemical composition and antimicrobial activity of essential oil of Ferula szovitsiana D.C.,
Flavour Fragr. J., 2007, 22, 3, 224-227, https://doi.org/10.1002/ffj.1789
. [all data]
Flamini, Cioni, et al., 2007
Flamini, G.; Cioni, P.L.; Morelli, I.; Bader, A.,
Essential oils of the aerial parts of three Salvia species from Jordan: Salvia lanigera, S. spinosa and S. syriaca,
Food Chem., 2007, 100, 2, 732-735, https://doi.org/10.1016/j.foodchem.2005.10.032
. [all data]
Lesueur, de Rocca Serra, et al., 2007
Lesueur, D.; de Rocca Serra, D.; Bighelli, A.; Hoi, T.M.; Ban, N.K.; Thai, T.H.; Casanova, J.,
Chemical composition and antibacterial activity of the essential oil of Michelia foveolata Merryll ex Dandy from Vietnam,
Flavour Fragr. J., 2007, 22, 4, 317-321, https://doi.org/10.1002/ffj.1799
. [all data]
Maccioni, Baldini, et al., 2007
Maccioni, S.; Baldini, R.; Luigi Cioni, P.; Tebano, M.; Flamini, G.,
In vivo volatiles emission and essential oils from different organs and pollen of Cistus albidus from Caprione (Eastern Liguria, Italy),
Flavour Fragr. J., 2007, 22, 1, 61-65, https://doi.org/10.1002/ffj.1759
. [all data]
Martins, Santos, et al., 2007
Martins, F.T.; Santos, M.H.; Polo, M.; Barbosa, L.C.A.,
Effects of the interactions among macronutrients, plant age and photoperiod in the composition of Hyptis suaveolens (L.) Poit essential oil from Alfenas (MG), Brazil,
Flavour Fragr. J., 2007, 22, 2, 123-129, https://doi.org/10.1002/ffj.1769
. [all data]
Paolini J., Costa J., et al., 2007
Paolini J.; Costa J.; Bernardini A.F.,
Analysis of the essential oil from the roots of Eupatorium cannabinum subsp corsicum (L.) by GC, GC-MS and C-13-NMR,
Phytochem. Anal., 2007, 18, 3, 235-244, https://doi.org/10.1002/pca.977
. [all data]
Politeo, Jukic, et al., 2007
Politeo, O.; Jukic, M.; Milos, M.,
Chemical composition and antioxidant capacity of free volatile aglycones from basil (Ocimum basilicum L.) compared with its essential oil,
Food Chem., 2007, 101, 1, 379-385, https://doi.org/10.1016/j.foodchem.2006.01.045
. [all data]
Radulovic, Lazarevic, et al., 2007
Radulovic, N.; Lazarevic, J.; Ristic, N.; Palic, R.,
Chemotaxonomic significance of the volatiles in the genus Stachys (Lamiaceae): Essential oil composition of four Balkan Stachys species,
Biochem. Syst. Ecol., 2007, 35, 4, 196-208, https://doi.org/10.1016/j.bse.2006.10.010
. [all data]
Saroglou, Marin, et al., 2007
Saroglou, V.; Marin, P.D.; Rancic, A.; Veljic, M.; Skaltsa, H.,
Composition and antimicrobial activity of the essential oil of six Hypericum species from Serbia,
Biochem. Syst. Ecol., 2007, 35, 3, 146-152, https://doi.org/10.1016/j.bse.2006.09.009
. [all data]
Sonboli, Azizian, et al., 2007
Sonboli, A.; Azizian, D.; Yousefzadi, M.; Kanani, M.R.; Mehrabian, A.R.,
Volatile constituents and antimicrobial activity of the essential oil of Tetrataenium lasiopetalum (Apiaceae) from Iran,
Flavour Fragr. J., 2007, 22, 2, 119-122, https://doi.org/10.1002/ffj.1767
. [all data]
Telascrea, de Araujo, et al., 2007
Telascrea, M.; de Araujo, C.C.; Marques, M.O.M.; Facanali, R.; de Moraes, P.L.R.; Cavalheiro, A.J.,
Essential oil from leaves of Cryptocarya mandioccana Meisner (Lauraceae): Composition and intraspecific chemical variability,
Biochem. Syst. Ecol., 2007, 35, 4, 222-232, https://doi.org/10.1016/j.bse.2006.09.015
. [all data]
Vagionas, Ngassapa, et al., 2007
Vagionas, K.; Ngassapa, O.; Runyoro, D.; Graikou, K.; Gortzi, O.; Chinou, I.,
Chemical analysis of edible aromatic plants growing in Tanzania,
Food Chem., 2007, 105, 4, 1711-1717, https://doi.org/10.1016/j.foodchem.2007.05.029
. [all data]
Basta, Tzakou, et al., 2006
Basta, A.; Tzakou, O.; Couladis, M.,
The essential oil composition of Phlomis cretica C. Presl,
Flavour Fragr. J., 2006, 21, 5, 795-797, https://doi.org/10.1002/ffj.1717
. [all data]
Blagojevic, Radulovic, et al., 2006
Blagojevic, P.; Radulovic, N.; Palic, R.; Stojanovic, G.,
Chemical composition of the essential oils of Serbian wild-growing Srtemisia absinthium and Artemisia vulgaris,
J. Agric. Food Chem., 2006, 54, 13, 4780-4789, https://doi.org/10.1021/jf060123o
. [all data]
Block, Flamini, et al., 2006
Block, S.; Flamini, G.; Brkic, D.; Morelli, I.; Quetin-Leclercq, J.,
Analysis of the essential oil from leaves of Croton zambesicus Muell. Arg. growing in Benin,
Flavour Fragr. J., 2006, 21, 2, 222-224, https://doi.org/10.1002/ffj.1558
. [all data]
Chorianopoulos N., Evergets E., et al., 2006
Chorianopoulos N.; Evergets E.; Mallouchos A.; Kalpoutzakis E.; Nychas G.J.; Haroutounian S.A.,
Characterization of the essential oil volatiles of Satureja thymbra and Satureja parnassica: Influence of harvesting time and antimicrobial activity,
J. Agric. Food Chem., 2006, 54, 8, 3139-3145, https://doi.org/10.1021/jf053183n
. [all data]
Dob, Dahmane, et al., 2006
Dob, T.; Dahmane, D.; Chelghoum, C.,
Essential oil composition of Juniperus oxycedrus growing in Algeria,
Pharm. Biol., 2006, 44, 1, 1-6, https://doi.org/10.1080/13880200500530922
. [all data]
Flamini, Tebano, et al., 2006
Flamini, G.; Tebano, M.; Cioni, P.L.; Bagci, Y.; Dural, H.; Ertugrul, K.; Uysal, T.; Savran, A.,
A multivariate statistical approach to Centaurea classification using essential oil composition data of some species from Turkey,
Pl. Syst. Evol., 2006, 261, 1-4, 217-228, https://doi.org/10.1007/s00606-006-0448-3
. [all data]
Javidnia, Miri, et al., 2006
Javidnia, K.; Miri, R.; Banani, A.,
Volatile oil constituents of Haplophyllum tuberculatum (Forssk.) A. Juss. (Rutaceae) from Iran,
J. Essent. Oil Res., 2006, 18, 4, 355-356, https://doi.org/10.1080/10412905.2006.9699111
. [all data]
Kuiate, Bessière, et al., 2006
Kuiate, J.R.; Bessière, J.M.; Vilarem, G.; Amvam Zollo, P.H.,
Chemical composition and antidermatophytic properties of the essential oils from leaves, flowers and fruits of Cupressus lusitanica Mill. from Cameroon,
Flavour Fragr. J., 2006, 21, 4, 693-697, https://doi.org/10.1002/ffj.1686
. [all data]
Kukic J., Petrovic S., et al., 2006
Kukic J.; Petrovic S.; Pavlovic M.; Couladis M.; Tzakou O.; Niketic M.,
Composition of essential oil of Stachys alpina L. ssp dinarica Murb.,
Flavour Fragr. J., 2006, 21, 3, 539-542, https://doi.org/10.1002/ffj.1684
. [all data]
Masoudi, Esmaeili, et al., 2006
Masoudi, S.; Esmaeili, A.; Khalilzadeh, M.A.; Rustaiyan, A.; Moazami, N.; Akhgar, M.R.; Varavipoor, M.,
Volatile constituents of Dorema aucheri Boiss., Seseli libanotis (L.) W. D. Koch var. armeniacum bordz. and Conium maculatum L. three Umbelliferae herbs growing wild in Iran,
Flavour Fragr. J., 2006, 21, 5, 801-804, https://doi.org/10.1002/ffj.1722
. [all data]
Pavlovic, Kovacevic, et al., 2006
Pavlovic, M.; Kovacevic, N.; Tzakou, O.; Couladis, M.,
Essential oil composition of Anthemis triumfetti (L.) DC.,
Flavour Fragr. J., 2006, 21, 2, 297-299, https://doi.org/10.1002/ffj.1592
. [all data]
Pavlovic, Tzakou, et al., 2006
Pavlovic, M.; Tzakou, O.; Petrakis, P.V.; Couladis, M.,
The essential oil of Hypericum perforatum L., Hypericum tetrapterum Fries and Hypericum olympicum L. growing in Greece,
Flavour Fragr. J., 2006, 21, 1, 84-87, https://doi.org/10.1002/ffj.1521
. [all data]
Pinto, Pina-Vaz, et al., 2006
Pinto, E.; Pina-Vaz, C.; Salgueiro, L.; Goncalves, M.J.; Costa-de-Oliveira, S.; Cavaleiro, C.; Palmeira, A.; Rodrigues, A.; Martinez-de-Oliveira, J.,
Antifuncal activity of the essential oil Thymus pulegioides on Candida, Aspergillus and dermatophyte species,
Journal of Medical Microbiology, 2006, 55, 10, 1367-1373, https://doi.org/10.1099/jmm.0.46443-0
. [all data]
Radulovic, Lazarevic, et al., 2006
Radulovic, N.; Lazarevic, J.; Stojanovic, G.; Palic, R.,
Chemotaxonomically significant 2-ethyl substituted fatty acids from Stachys milanii Petrovic (Lamiaceae),
Biochem. Syst. Ecol., 2006, 34, 4, 341-344, https://doi.org/10.1016/j.bse.2005.10.008
. [all data]
Radulovic, Mananjarasoa, et al., 2006
Radulovic, N.; Mananjarasoa, E.; Harinantenaina, L.; Yoshinori, A.,
Essential oil composition of four Croton species from Madagascar and their chemotaxonomy,
Biochem. Syst. Ecol., 2006, 34, 8, 648-653, https://doi.org/10.1016/j.bse.2006.02.005
. [all data]
Salgueiro L.R., Pinto E., et al., 2006
Salgueiro L.R.; Pinto E.; Goncalves M.J.; Costa I.; Palmeira A.; Cavaleiro C.; Pina-Vaz C.; Rodrigues A.G.; Martinez-De-Oliveira J.,
Antifungal activity of the essential oil of Thymus capitellatus against Candida, Aspergillus and dermatophyte strains,
Flavour Fragr. J., 2006, 21, 5, 749-753, https://doi.org/10.1002/ffj.1610
. [all data]
Saroglou, Dorizas, et al., 2006
Saroglou, V.; Dorizas, N.; Kypriotakis, Z.; Skaltsa, H.D.,
Analysis of the essential oil composition of eight Anthemis species from Greece,
J. Chromatogr. A, 2006, 1104, 1-2, 313-322, https://doi.org/10.1016/j.chroma.2005.11.087
. [all data]
Silva-Brandão, Solferini, et al., 2006
Silva-Brandão, K.L.; Solferini, V.N.; Trigo, J.R.,
Chemical and phylogenetic relationships among Aristolochia L. (Aristolochiaceae) from southeastern Brazil,
Biochem. Syst. Ecol., 2006, 34, 4, 291-302, https://doi.org/10.1016/j.bse.2005.10.011
. [all data]
Su, Ho, et al., 2006
Su, Y.C.; Ho, C.L.; Wang, E.I.C.,
Analysis of leaf essential oils from the indigenous five conifers of Taiwan,
Flavour Fragr. J., 2006, 21, 3, 447-452, https://doi.org/10.1002/ffj.1685
. [all data]
Vujisic L., Vuckovic I., et al., 2006
Vujisic L.; Vuckovic I.; Tesevic V.; Dokovic D.; Ristic M.S.; Janackovic P.; Milosavljevic S.,
Comparative examination of the essential oils of Anthemis ruthenica and A-arvensis wild-growing in Serbia,
Flavour Fragr. J., 2006, 21, 3, 458-461, https://doi.org/10.1002/ffj.1681
. [all data]
Vundac, Pfeifhofer, et al., 2006
Vundac, V.B.; Pfeifhofer, H.W.; Brantner, A.H.; Males, Z.; Plazibat, M.,
Essential oils of seven Stachys taxa from Croatia,
Biochem. Syst. Ecol., 2006, 34, 12, 875-881, https://doi.org/10.1016/j.bse.2006.04.010
. [all data]
Boskovic, Radulovic, et al., 2005
Boskovic, Z.; Radulovic, N.; Stojanovic, G.,
Essential oil composition of four Achillea species from the balkans and its chemotaxonomic significance,
Chem. Nat. Compd. (Engl. Transl.), 2005, 41, 6, 674-678, https://doi.org/10.1007/s10600-006-0009-6
. [all data]
Brantner, Pfeifhofer, et al., 2005
Brantner, A.H.; Pfeifhofer, H.W.; Ercegovac, O.; Males, Z.; Plazibat, M.,
Essential oil composition and antioxidant activity of Thymus bracteosus Vis. ex Benth.,
Flavour Fragr. J., 2005, 20, 6, 596-600, https://doi.org/10.1002/ffj.1494
. [all data]
Celik, Gokturk, et al., 2005
Celik, S.; Gokturk, R.S.; Flamini, G.; Cioni, P.L.; Morelli, I.,
Essential oils of Phlomis leucophracta, Phlomis chimerae and Phlomis grandiflora var. grandiflora from Turkey,
Biochem. Syst. Ecol., 2005, 33, 6, 617-623, https://doi.org/10.1016/j.bse.2004.11.010
. [all data]
Dob, Berramdane, et al., 2005
Dob, T.; Berramdane, T.; Dahmane, D.; Chelghoum, C.,
Chemical composition of the needles oil of Pinus canariensis from Algeria,
Chem. Nat. Compd. (Engl. Transl.), 2005, 41, 2, 165-167, https://doi.org/10.1007/s10600-005-0103-1
. [all data]
Dob, Dahmane, et al., 2005
Dob, T.; Dahmane, D.; Berramdane, T.; Chelghoum, C.,
Chemical composition of the essential oil of Artemisia campestris L. from Algeria,
Pharm. Biol., 2005, 43, 6, 512-514, https://doi.org/10.1080/13880200500220664
. [all data]
Fanciullino, Gancel, et al., 2005
Fanciullino, A.-L.; Gancel, A.-L.; Froelicher, Y.; Luro, F.; Ollitrault, P.; Brillouet, J.-M.,
Effects of Nucleo-cytoplasmic Interactions on Leaf Volatile Compounds from Citrus Somatic Diploid Hybrids,
J. Agric. Food Chem., 2005, 53, 11, 4517-4523, https://doi.org/10.1021/jf0502855
. [all data]
Flamini, Luigi Cioni, et al., 2005
Flamini, G.; Luigi Cioni, P.; Morelli, I.; Celik, S.; Gokturk, R.S.; Unal, O.,
Essential oil of Stachys aleurites from Turkey,
Biochem. Syst. Ecol., 2005, 33, 1, 61-66, https://doi.org/10.1016/j.bse.2004.05.013
. [all data]
Flamini, Luigi Cioni, et al., 2005, 2
Flamini, G.; Luigi Cioni, P.; Morelli, I.,
Composition of the essential oils and in vivo emission of volatiles of four Lamium species from Italy: L. purpureum, L. hybridum, L. bifidum and L. amplexicaule,
Food Chem., 2005, 91, 1, 63-68, https://doi.org/10.1016/j.foodchem.2004.05.047
. [all data]
Gancel, Ollitrault, et al., 2005
Gancel, A.-L.; Ollitrault, P.; Froelicher, Y.; Tomi, F.; Jacquemond, C.; Luro, F.; Brillouet, J.-M.,
Leaf volatile compounds of six citrus somatic allotetraploid hybrids originating from various combinations of lime, lemon, citron, sweet orange, and grapefruit,
J. Agric. Food Chem., 2005, 53, 6, 2224-2230, https://doi.org/10.1021/jf048315b
. [all data]
Idzojtic, Kajba, et al., 2005
Idzojtic, M.; Kajba, D.; Franjic, J.,
Differentiation of F1 hybrids P. nigra J. F. Arnold × P. sylvestris L., P. nigra J. F. Arnold × P. densiflora Siebold et Zucc., P. nigra J. F. Arnold × P. thunbergiana Franco and their parental species by needle volatile composition,
Biochem. Syst. Ecol., 2005, 33, 4, 427-439, https://doi.org/10.1016/j.bse.2004.10.008
. [all data]
bin Jantan, Yalvema, et al., 2005
bin Jantan, I.; Yalvema, M.F.; Ahmad, N.W.; Jamal, J.A.,
Insecticidal activities of the leaf oils of eight Cinnamomum species against Aedes aegypti and Aedes albopictus,
Pharm. Biol., 2005, 43, 6, 526-532, https://doi.org/10.1080/13880200500220771
. [all data]
Javidnia, Miri, et al., 2005
Javidnia, K.; Miri, R.; Mehregan, I.; Sadeghpour, H.,
Volatile constituents of the essential oil of Nepeta ucrainica L. ssp. kopetdaghensis from Iran,
Flavour Fragr. J., 2005, 20, 2, 219-221, https://doi.org/10.1002/ffj.1381
. [all data]
Javidnia, Miri, et al., 2005, 2
Javidnia, K.; Miri, R.; Jamalian, A.,
Composition of the essential oil of Salvia macrosiphon Boiss. from Iran,
Flavour Fragr. J., 2005, 20, 5, 542-543, https://doi.org/10.1002/ffj.1468
. [all data]
Paolini, Costa, et al., 2005
Paolini, J.; Costa, J.; Bernardini, A.,
Analysis of the essential oil from aerial parts of Eupatorium cannabinum subsp. corsicum (L.) by gas chromatography with electron impact and chemical ionization mass spectrometry,
J. Chromatogr. A, 2005, 1076, 1-2, 170-178, https://doi.org/10.1016/j.chroma.2005.03.131
. [all data]
Simionatto, Porto, et al., 2005
Simionatto, E.; Porto, C.; da Silva, U.F.; Squizani, A.; Dalcol, I.I.; Morel, A.F.,
Composition and antimicrobial activity of the essential oil from Aloysia sellowii,
J. Braz. Chem. Soc., 2005, 16, 6B, 1458-1462, https://doi.org/10.1590/S0103-50532005000800028
. [all data]
Tchoumbougnang, Zollo, et al., 2005
Tchoumbougnang, F.; Zollo, P.H.A.; Boyom, F.F.; Nyegue, M.A.; Bessière, J.M.; Menut, C.,
Aromatic plants of tropical Central Africa. XLVIII. Comparative study of the essential oils of four Hyptis species from Cameroon: H. lanceolata Poit., H. pectinata (L.) Poit., H. spicigera Lam. and H. suaveolens Poit.,
Flavour Fragr. J., 2005, 20, 3, 340-343, https://doi.org/10.1002/ffj.1441
. [all data]
Vellutini, Baldovini, et al., 2005
Vellutini, M.; Baldovini, N.; de Rocca Serra, D. Tomi; Casanova, J.,
β-Cyclolavandulyl and β-isocyclolavandulyl esters from Peucedanum paniculatum L., an endemic species to Corsica,
Phytochemistry, 2005, 66, 16, 1956-1962, https://doi.org/10.1016/j.phytochem.2005.07.001
. [all data]
Zhao, Liang, et al., 2005
Zhao, C.-X.; Liang, Y.-Z.; Fang, H.-Z.; Li, X.-N.,
Temperature-programmed retention indices for gas chromatography-mass spectroscopy analysis of plant essential oils,
J. Chromatogr. A, 2005, 1096, 1-2, 76-85, https://doi.org/10.1016/j.chroma.2005.09.067
. [all data]
Aligiannis, Kalpoutzakis, et al., 2004
Aligiannis, N.; Kalpoutzakis, E.; Kyriakopoulou, I.; Mitaku, S.; Chinou, I.B.,
Essential oils of Phlomis species growing in Greece: chemical composition and antimicrobial activity,
Flavour Fragr. J., 2004, 19, 4, 320-324, https://doi.org/10.1002/ffj.1305
. [all data]
Antunes, Sevinate-Pinto, et al., 2004
Antunes, T.; Sevinate-Pinto, I.; Barroso, J.G.; Cavaleiro, C.; Salgueiro, L.R.,
Micromorphology of trichomes and composition of essential oil of Teucrium capitatum,
Flavour Fragr. J., 2004, 19, 4, 336-340, https://doi.org/10.1002/ffj.1310
. [all data]
Bertoli, Menichini, et al., 2004
Bertoli, A.; Menichini, F.; Noccioli, C.; Morelli, I.; Pistelli, L.,
Volatile constituents of different organs of Psoralea bituminosa L.,
Flavour Fragr. J., 2004, 19, 2, 166-171, https://doi.org/10.1002/ffj.1315
. [all data]
Cavaleiro, Salgueiro, et al., 2004
Cavaleiro, C.; Salgueiro, L.R.; Miguel, M.G.; da Cunha, A.P.,
Analysis by gas chromatography?mass spectrometry of the volatile components of Teucrium lusitanicum and Teucrium algarbiensis,
J. Chromatogr. A, 2004, 1033, 1, 187-190, https://doi.org/10.1016/j.chroma.2004.01.005
. [all data]
Ceccarini, Macchia, et al., 2004
Ceccarini, L.; Macchia, M.; Flamini, G.; Cioni, P.L.; Caponi, C.; Morelli, I.,
Essential oil composition of Helianthus annuus L. leaves and heads of two cultivated hybride Carlos and Florom 350,
Ind. Crops Prod., 2004, 19, 1, 13-17, https://doi.org/10.1016/S0926-6690(03)00076-1
. [all data]
Chorianopoulos, Kalpoutzakis, et al., 2004
Chorianopoulos, N.; Kalpoutzakis, E.; Aligiannis, N.; Mitaku, S.; Nychas, G.-J.; Haroutounian, S.A.,
Essential oils of Satureja, Origanum, and Thymus species: chemical composition and antibacterial activities against foodborne pathogens,
J. Agric. Food Chem., 2004, 52, 26, 8261-8267, https://doi.org/10.1021/jf049113i
. [all data]
Flamini, Bader, et al., 2004
Flamini, G.; Bader, A.; Cioni, P.L.; Katbeh-Bader, A.; Morelli, I.,
Composition of the essential oil of leaves, galls, and ripe and unripe fruits of Jordian Pistacia palaestina Boiss.,
J. Agric. Food Chem., 2004, 52, 3, 572-576, https://doi.org/10.1021/jf034773t
. [all data]
Flamini, Cioni, et al., 2004
Flamini, G.; Cioni, P.L.; Morelli, I.; Maccioni, S.; Baldini, R.,
Phytochemical typologies in some populations of Myrtus communis L. on Caprione Promontory (East Liguria, Italy),
Food Chem., 2004, 85, 4, 599-604, https://doi.org/10.1016/j.foodchem.2003.08.005
. [all data]
Flamini, Luigi Cioni, et al., 2004
Flamini, G.; Luigi Cioni, P.; Morelli, I.,
Essential oils of Galeopsis pubescens and G. tetrahit from Tuscany (Italy),
Flavour Fragr. J., 2004, 19, 4, 327-329, https://doi.org/10.1002/ffj.1307
. [all data]
Grujic-Jovanovic, Skaltsa, et al., 2004
Grujic-Jovanovic, S.; Skaltsa, H.D.; Marin, P.; Sokovic, M.,
Composition and antibacterial activity of the essential oil of six Stachys species from Serbia,
Flavour Fragr. J., 2004, 19, 2, 139-144, https://doi.org/10.1002/ffj.1275
. [all data]
Isidorov, Krajewska, et al., 2004
Isidorov, V.A.; Krajewska, U.; Vinogorova, V.T.; Vetchinnikova, L.V.; Fuksman, I.L.; Bal, K.,
Gas chromatographic analysis of essential oil from buds of different birch species with preliminary partition of components,
Biochem. Syst. Ecol., 2004, 32, 1, 1-13, https://doi.org/10.1016/S0305-1978(03)00175-3
. [all data]
Javidnia, Miri, et al., 2004
Javidnia, K.; Miri, R.; Jafari, A.; Rezai, H.,
Analysis of the volatile constituents of Nepeta macrosiphon Boiss. grown in Iran,
Flavour Fragr. J., 2004, 19, 2, 156-158, https://doi.org/10.1002/ffj.1287
. [all data]
Javidnia, Miri, et al., 2004, 2
Javidnia, K.; Miri, R.; Kamalinejad, M.; Sarkarzadeh, H.; Jamalian, A.,
Chemical composition of the essential oils of Anthemis altissima L. grown in Iran,
Flavour Fragr. J., 2004, 19, 3, 213-216, https://doi.org/10.1002/ffj.1277
. [all data]
Moldão-Martins, Beirão-da-Costa, et al., 2004
Moldão-Martins, M.; Beirão-da-Costa, S.; Neves, C.; Cavaleiro, C.; Salgueiro, L.; Beirão-da-Costa, M.L.,
Olive oil flavoured by the essential oils of Mentha × piperita and Thymus mastichina L.,
Food Qual. Pref., 2004, 15, 5, 447-452, https://doi.org/10.1016/j.foodqual.2003.08.001
. [all data]
Ngassoum, Ousmaila, et al., 2004
Ngassoum, M.B.; Ousmaila, H.; Ngamo, L.T.; Maponmetsem, P.M.; Jirovetz, L.; Buchbauer, G.,
Aroma compounds of essential oils of two varieties of the spice plant Ocimum canum Sims from northern Cameroon,
J. Food Comp. Anal., 2004, 17, 2, 197-204, https://doi.org/10.1016/j.jfca.2003.08.002
. [all data]
Özcan and Chalchat, 2004
Özcan, M.; Chalchat, J.-C.,
Aroma profile of Thymus vulgaris L. growing wild in Turkey,
Bulg. J. Plant Physiol., 2004, 30, 3-4, 68-73. [all data]
Sartoratto, Machado, et al., 2004
Sartoratto, A.; Machado, A.L.M.; Delarmelina, C.; Figueira, G.M.; Duarte, M.C.T.; Rehder, V.L.G.,
Composition and antimicrobial activity of essential oils from aromatic plants used in Brazil,
Braz. J. Microbiol., 2004, 35, 4, 275-280, https://doi.org/10.1590/S1517-83822004000300001
. [all data]
Stashenko, Jaramillo, et al., 2004
Stashenko, E.E.; Jaramillo, B.E.; Martínez, J.R.,
Comparison of different extraction methods for the analysis of volatile secondary metabolites of Lippia alba (Mill.) N.E. Brown, grown in Colombia, and evaluation of its in vitro antioxidant activity,
J. Chromatogr. A, 2004, 1025, 1, 93-103, https://doi.org/10.1016/j.chroma.2003.10.058
. [all data]
Tzakou, Vagias, et al., 2004
Tzakou, O.; Vagias, C.; Gani, A.; Yannitsaros, A.,
Volatile constituents of essential oils isolated at different growth stages from three Conyza species growing in Greece,
Flavour Fragr. J., 2004, 19, 425-428. [all data]
Yu, Kim, et al., 2004
Yu, E.J.; Kim, T.H.; Kim, K.H.; Lee, H.J.,
Aroma-active compounds of Pinus densiflora (red pine) needles,
Flavour Fragr. J., 2004, 19, 6, 532-537, https://doi.org/10.1002/ffj.1337
. [all data]
bin Ahmad and bin Jantan, 2003
bin Ahmad, F.; bin Jantan, I.,
Chemical constituents of the essential oils of Goniothalamus uvariodes King,
Flavour Fragr. J., 2003, 18, 2, 128-130, https://doi.org/10.1002/ffj.1142
. [all data]
Bader, Caponi, et al., 2003
Bader, A.; Caponi, C.; Cioni, P.L.; Flamini, G.; Morelli, I.,
Composition of the essential oil of Ballota undulata, B. nigra ssp. foetida and B. saxatilis,
Flavour Fragr. J., 2003, 18, 6, 502-504, https://doi.org/10.1002/ffj.1257
. [all data]
Boyom, Assembe, et al., 2003
Boyom, F.F.; Assembe, E.Z.; Zollo, P.H.A.; Agnaniet, H.; Menut, C.; Bessière, J.M.,
Aromatic plants of tropical central Africa. Part XLII. Volatile components from Antidesma laciniatum Muell. Arg. Var. laciniatum growing in Cameroon,
Flavour Fragr. J., 2003, 18, 5, 451-453, https://doi.org/10.1002/ffj.1251
. [all data]
Dural, Bagci, et al., 2003
Dural, H.; Bagci, Y.; Ertugrul, K.; Demirelma, H.; Flamini, G.; Cioni, P.L.; Morelli, I.,
Essential oil composition of two endemic Centaurea species from Turkey, Centaurea mucronifera and Centaurea chrysantha, collected in the same habitat,
Biochem. Syst. Ecol., 2003, 31, 12, 1417-1425, https://doi.org/10.1016/S0305-1978(03)00128-5
. [all data]
Ertugrul, Dural, et al., 2003
Ertugrul, K.; Dural, H.; Tugay, O.; Flamini, G.; Cioni, P.L.; Morelli, I.,
Essential oils from flowers of Centaurea kotschyi var. kotschyi and C. kotschyi var. decumbens from Turkey,
Flavour Fragr. J., 2003, 18, 2, 95-97, https://doi.org/10.1002/ffj.1168
. [all data]
de Feo, Bruno, et al., 2003
de Feo, V.; Bruno, M.; Tahiri, B.; Napolitano, F.; Senatore, F.,
Chemical composition and antibacterial activity of essential oils from Thymus spinulosus Ten. (Lamiaceae),
J. Agric. Food Chem., 2003, 51, 13, 3849-3853, https://doi.org/10.1021/jf021232f
. [all data]
Gancel, Ollitrault, et al., 2003
Gancel, A.-L.; Ollitrault, P.; Froelicher, Y.; Tomi, F.; Jacquemond, C.; Luro, F.; Brillouet, J.-M.,
Leaf volatile compounds of seven citrus somatic tetraploid hybrids sharing willow leaf mandarin (Citrus deliciosa Ten.) as their common parent,
J. Agric. Food Chem., 2003, 51, 20, 6006-6013, https://doi.org/10.1021/jf0345090
. [all data]
Isidorov, Vinogorova, et al., 2003
Isidorov, V.A.; Vinogorova, V.T.; Rafalowski, K.,
HS-SPME analysis of volatile organic compounds of coniferous needle litter,
Atmos. Environ., 2003, 37, 33, 4645-4650, https://doi.org/10.1016/j.atmosenv.2003.07.005
. [all data]
Karioti, Skaltsa, et al., 2003
Karioti, A.; Skaltsa, H.; Demetzos, C.; Perdetzoglou, D.; Economakis, C.D.; Salem, A.B.,
Effect of nitrogen concentration of the nutrient solution on the volatile constituents of leaves of Salvia fruticosa Mill. in solution culture,
J. Agric. Food Chem., 2003, 51, 22, 6505-6508, https://doi.org/10.1021/jf030308k
. [all data]
Macchioni, Cioni, et al., 2003
Macchioni, F.; Cioni, P.L.; Flamini, G.; Morelli, I.; Maccioni, S.; Ansaldi, M.,
Chemical composition of essential oils from needles, branches and cones of Pinus pinea, P. halepensis, P. pinaster and P. nigra from central Italy,
Flavour Fragr. J., 2003, 18, 2, 139-143, https://doi.org/10.1002/ffj.1178
. [all data]
Ngassapa, Runyoro, et al., 2003
Ngassapa, O.; Runyoro, D.K.B.; Harvala, E.; Chinou, I.B.,
Composition and antimicrobial activity of essential oils of two populations of Tanzanian Lippia javanica (Burm. f.) Spreng. (Verbenaceae),
Flavour Fragr. J., 2003, 18, 3, 221-224, https://doi.org/10.1002/ffj.1195
. [all data]
Skaltsa, Demetzos, et al., 2003
Skaltsa, H.D.; Demetzos, C.; Lazari, D.; Sokovic, M.,
Essential oil analysis and antimicrobial activity of eight Stachys species from Greece,
Phytochemistry, 2003, 64, 3, 743-752, https://doi.org/10.1016/S0031-9422(03)00386-8
. [all data]
Tzakou, Couladis, et al., 2003
Tzakou, O.; Couladis, M.; Slavkovska, V.; Mimica-Dukic, N.; Jancic, R.,
The essential oil composition of Salvia brachyodon Vandas,
Flavour Fragr. J., 2003, 18, 1, 2-4, https://doi.org/10.1002/ffj.1132
. [all data]
Cavaleiro, Salgueiro, et al., 2002
Cavaleiro, C.; Salgueiro, L.R.; Antunes, T.; Sevinate-Pinto, I.; Barroso, J.G.,
Composition of the essential oil and micromorphology of trichomes of Teucrium salviastrum, an endemic species from Portugal,
Flavour Fragr. J., 2002, 17, 4, 287-291, https://doi.org/10.1002/ffj.1068
. [all data]
Hudaib, Speroni, et al., 2002
Hudaib, M.; Speroni, E.; di Pietra, A.M.; Cavrini, V.,
GC/MS evaluation of thyme (Thymus vulgaris L.) oil composition and variations during the vegetative cycle,
J. Pharm. Biomed. Anal., 2002, 29, 4, 691-700, https://doi.org/10.1016/S0731-7085(02)00119-X
. [all data]
bin Jantan and bin Ahmad, 2002
bin Jantan, I.; bin Ahmad, F.,
Chemical constituents of the essential oils of Goniothalamus malayanus Hook. f. and Thoms.,
Flavour Fragr. J., 2002, 17, 5, 372-374, https://doi.org/10.1002/ffj.1107
. [all data]
Javidnia, Miri, et al., 2002
Javidnia, K.; Miri, R.; Safavi, F.; Azarpira, A.; Shafiee, A.,
Composition of the essential oil of Nepeta persica Boiss from Iran,
Flavour Fragr. J., 2002, 17, 1, 20-22, https://doi.org/10.1002/ffj.1023
. [all data]
Miri, Ramezani, et al., 2002
Miri, R.; Ramezani, M.; Javidnia, K.; Ahmadi, L.,
Composition of the volatile oil of Thymus transcaspicus Klokov from Iran,
Flavour Fragr. J., 2002, 17, 4, 245-246, https://doi.org/10.1002/ffj.1104
. [all data]
Nath, Sarma, et al., 2002
Nath, S.C.; Sarma, K.K.; Vajezikova, I.; Leclercq, P.A.,
Comparison of volatile inflorescence oils and taxonomy of certain Cymbopogon taxa described as Cymbopogon flexuosus (Nees ex Steud.) Wats.,
Biochem. Syst. Ecol., 2002, 30, 2, 151-162, https://doi.org/10.1016/S0305-1978(01)00066-7
. [all data]
Pino, Marbot, et al., 2002
Pino, J.A.; Marbot, R.; Vázquez, C.,
Characterization of volatile in Cosa Rican Guava [Psidium friedrichsthalianum (Berg) Niedenzu] fruit,
J. Agric. Food Chem., 2002, 50, 21, 6023-6026, https://doi.org/10.1021/jf011456i
. [all data]
Shellie, Mondello, et al., 2002
Shellie, R.; Mondello, L.; Marriott, P.; Dugo, G.,
Characterisation of lavender essential oils by using gas chromatography-mass spectrometry with correlation of linear retention indices and comparison with comprehensive two-dimensional gas chromatography,
J. Chromatogr. A, 2002, 970, 1-2, 225-234, https://doi.org/10.1016/S0021-9673(02)00653-2
. [all data]
Aligiannis, Kalpoutzakis, et al., 2001
Aligiannis, N.; Kalpoutzakis, E.; Chinou, I.B.; Mitaku, S.; Gikas, E.; Tsarbopoulos, A.,
Composition and antimicrobial activity of the essential oils of five taxa of Sideritis from Greece,
J. Agric. Food Chem., 2001, 49, 2, 811-815, https://doi.org/10.1021/jf001018w
. [all data]
Guilliard, Delgado, et al., 2001
Guilliard, M.; Delgado, W.; Martínez, J.R.; Stashenko, E.,
Determination of the enantiomeric purity of carvone, main component of Colombian Lippia alba (Mill) oil by means of bidimensional gas chromatography (23rd International Symposium on Capillary Chromatography), 2001, retrieved from http://www.richrom.com/assets/CD23PDF/i01.pdf. [all data]
Hudaib, Grazia Bellardi, et al., 2001
Hudaib, M.; Grazia Bellardi, M.; Rubies-Autonell, C.; Fiori, J.; Cavrini, V.,
Chromatographic (GC-MS, HPLC) and virological evaluations of Salvia sclarea infected by BBWV-I,
Farmaco, 2001, 56, 3, 219-227, https://doi.org/10.1016/S0014-827X(01)01038-2
. [all data]
Rezzi, Cavaleiro, et al., 2001
Rezzi, S.; Cavaleiro, C.; Bighelli, A.; Salgueiro, L.; da Cunha, A.P.; Casanova, J.,
Intraspecific chemical variability of the leaf essential oil of Juniperus phoenicea subsp. turbinata from Corsica,
Biochem. Syst. Ecol., 2001, 29, 2, 179-188, https://doi.org/10.1016/S0305-1978(00)00044-2
. [all data]
Skaltsa, Mavrommati, et al., 2001
Skaltsa, H.D.; Mavrommati, A.; Constantinidis, T.,
A chemotaxonomic investigation of volatile constituents in Stachys subsect. Swainsonianeae (Labiatae),
Phytochemistry, 2001, 57, 2, 235-244, https://doi.org/10.1016/S0031-9422(01)00003-6
. [all data]
Kim, Thuy, et al., 2000
Kim, T.H.; Thuy, N.T.; Shin, J.H.; Baek, H.H.; Lee, H.J.,
Aroma-active compounds of miniature beefsteakplant (Mosla dianthera Maxim.),
J. Agric. Food Chem., 2000, 48, 7, 2877-2881, https://doi.org/10.1021/jf000219x
. [all data]
Maia, de Paula, et al., 2000
Maia, B.H.L.N.S.; de Paula, J.R.; Sant'Ana, J.; da Silva, M.F.G.F.; Fernandes, J.B.; Vieira, P.C.; Costa, M.S.S.; Ohashi, O.S.; Silva, J.N.M.,
Essential oils of Toona and Cedrela species (Meliaceae): Taxonomic and ecological implications,
J. Braz. Chem. Soc., 2000, 11, 6, 629-639, https://doi.org/10.1590/S0103-50532000000600012
. [all data]
Milos and Radonic, 2000
Milos, M.; Radonic, A.,
Gas chromatography mass spectral analysis of free and glycosidically bound volatile compounds from Juniperus oxycedrus L. growing wild in Croatia,
Food Chem., 2000, 68, 3, 333-338, https://doi.org/10.1016/S0308-8146(99)00192-2
. [all data]
Pfeifhofer, 2000
Pfeifhofer, H.W.,
Composition of the essential oil of Pinus canariensis Sweet ex Sprengel,
Flavour Fragr. J., 2000, 15, 4, 266-270, https://doi.org/10.1002/1099-1026(200007/08)15:4<266::AID-FFJ908>3.0.CO;2-E
. [all data]
Skaltsa, Lazari, et al., 2000
Skaltsa, H.D.; Lazari, D.M.; Loukis, A.E.; Constantinidis, T.,
Essential oil analysis of Nepeta argolica Bory Chaub. subsp. argolica (Lamiaceae) growing wild in Greece,
Flavour Fragr. J., 2000, 15, 2, 96-99, https://doi.org/10.1002/(SICI)1099-1026(200003/04)15:2<96::AID-FFJ873>3.0.CO;2-F
. [all data]
Lazari, Skaltsa, et al., 1999
Lazari, D.M.; Skaltsa, H.D.; Constantinidis, T.,
Essential oils of Marrubium velutinum Sm. and Marrubium peregrinum L., growing wild in Greece,
Flavour Fragr. J., 1999, 14, 5, 290-292, https://doi.org/10.1002/(SICI)1099-1026(199909/10)14:5<290::AID-FFJ828>3.0.CO;2-4
. [all data]
Mirza and Sefidkon, 1999
Mirza, M.; Sefidkon, F.,
Essential oil composition of two Salvia species from Iran, Salvia nemorosa L. and Salvia reuterana Boiss.,
Flavour Fragr. J., 1999, 14, 4, 230-232, https://doi.org/10.1002/(SICI)1099-1026(199907/08)14:4<230::AID-FFJ816>3.0.CO;2-L
. [all data]
Muselli, Hoi, et al., 1999
Muselli, A.; Hoi, T.M.; Cu, L.D.; Moi, L.D.; Bessière, J.-M.; Bighelli, A.; Casanova, J.,
Composition of the essential oil of Acanthopanax trifoliatus (L.) Merr. (Araliacaea) from Vietnam,
Flavour Fragr. J., 1999, 14, 1, 41-44, https://doi.org/10.1002/(SICI)1099-1026(199901/02)14:1<41::AID-FFJ781>3.0.CO;2-B
. [all data]
Sumathykutty, Rao, et al., 1999
Sumathykutty, M.A.; Rao, J.M.; Padmakumari, K.P.; Narayanan, C.S.,
Essential oil constituents of some Piper species,
Flavour Fragr. J., 1999, 14, 5, 279-282, https://doi.org/10.1002/(SICI)1099-1026(199909/10)14:5<279::AID-FFJ821>3.0.CO;2-0
. [all data]
Bicchi, Rubiolo, et al., 1998
Bicchi, C.; Rubiolo, P.; Marschall, H.; Weyerstahl, P.; Laurent, R.,
Constituents of Artemisia roxburghiana Besser essential oil,
Flavour Fragr. J., 1998, 13, 1, 40-46, https://doi.org/10.1002/(SICI)1099-1026(199801/02)13:1<40::AID-FFJ688>3.0.CO;2-Z
. [all data]
Sagrero-Nieves, Bartley, et al., 1997
Sagrero-Nieves, L.; Bartley, J.P.; Griselda Espinosa, B.; Dominguez, X.A.; Julia Verde S.,
Essential oil composition of Aristolochia brevipes Benth.,
Flavour Fragr. J., 1997, 12, 6, 401-403, https://doi.org/10.1002/(SICI)1099-1026(199711/12)12:6<401::AID-FFJ673>3.0.CO;2-D
. [all data]
Chung, Eiserich, et al., 1993
Chung, T.Y.; Eiserich, J.P.; Shibamoto, T.,
Volatile compounds isolated from edible Korean chamchwi (Aster scaber Thunb),
J. Agric. Food Chem., 1993, 41, 10, 1693-1697, https://doi.org/10.1021/jf00034a033
. [all data]
Montanarella, Bos, et al., 1986
Montanarella, L.; Bos, R.; Fischer, F.C.,
The Essential Oil in Lamina and Petiole of Heracleum dissectum Leaves,
Planta Medica, 1986, 52, 04, 332-334, https://doi.org/10.1055/s-2007-969171
. [all data]
Andrade, Sampaio, et al., 2007
Andrade, M.S.; Sampaio, T.S.; Nogueira, P.C.L.; Ribeiro, A.S.; Bittrich, V.; Amaral, M.C.E.,
Volatile compounds of the leaves, flowers and fruits of Kielmeyera rugosa Choisy (Clusiaceae),
Flavour Fragr. J., 2007, 22, 1, 49-52, https://doi.org/10.1002/ffj.1751
. [all data]
Bruni, Bianchi, et al., 2007
Bruni, R.; Bianchi, A.; Bellardi, M.G.,
Essential oil composition of Agastache anethiodora Britton (Lamiaceae) infected by cucumber mosaic virus (CMV),
Flavour Fragr. J., 2007, 22, 1, 66-70, https://doi.org/10.1002/ffj.1760
. [all data]
Cardeal, da Silva, et al., 2006
Cardeal, Z.L.; da Silva, M.D.R.G.; Marriott, P.J.,
Comprehensive two-dimensional gas chromatography/mass spectrometric analysis of pepper volatiles,
Rapid Commun. Mass Spectrom., 2006, 20, 19, 2823-2836, https://doi.org/10.1002/rcm.2665
. [all data]
Özel, Gögüs, et al., 2006
Özel, M.Z.; Gögüs, F.; Lewis, A.C.,
Determination of Teucrium chamaedrys volatiles by using direct thermal desorption-comprehensive two-dimensional gas chromatography-time-of-flight mass spectrometry,
J. Chromatogr. A, 2006, 1114, 1, 164-169, https://doi.org/10.1016/j.chroma.2006.02.036
. [all data]
Bruni, Pellati, et al., 2005
Bruni, R.; Pellati, F.; Grazia Bellardi, M.; Benvenuti, S.; Paltrinieri, S.; Bertaccini, A.; Bianchi, A.,
Herbal drug quality and phytochemical composition of Hypericum perforatum L. affected by ash yellows phytoplasma infection,
J. Agric. Food Chem., 2005, 53, 4, 964-968, https://doi.org/10.1021/jf0487654
. [all data]
Oliveira, Campos, et al., 2005
Oliveira, M.J.; Campos, I.F.P.; Oliveira, C.B.A.; Santos, M.R.; Souza, P.S.; Santos, S.C.; Seraphin, J.C.; Ferri, P.H.,
Influence of growth phase on the essential oil composition of Hyptis suaveolens,
Biochem. Syst. Ecol., 2005, 33, 3, 275-285, https://doi.org/10.1016/j.bse.2004.10.001
. [all data]
Sacchetti, Maietti, et al., 2005
Sacchetti, G.; Maietti, S.; Muzzoli, M.; Scaglianti, M.; Manfredini, S.; Radice, M.; Bruni, R.,
Comparative evaluation of 11 essential oils of different origin as functional antioxidants, antiradicals and antimicrobials in foods,
Food Chem., 2005, 91, 4, 621-632, https://doi.org/10.1016/j.foodchem.2004.06.031
. [all data]
Zheng, Kim, et al., 2005
Zheng, C.H.; Kim, K.H.; Kim, T.H.; Lee, H.J.,
Analysis and characterization of aroma-active compounds of Schizandra chinensis (omija) leaves,
J. Sci. Food Agric., 2005, 85, 1, 161-166, https://doi.org/10.1002/jsfa.1975
. [all data]
Lorenzo, Paz, et al., 2004
Lorenzo, D.; Paz, D.; Davies, P.; Villamil, J.; Vila, R.; Cañigueral, S.; Dellacassa, E.,
Characterization and enantiomeric distribution of some terpenes in the essential oil of a Uruguayan biotype of Salvia sclarea L.,
Flavour Fragr. J., 2004, 19, 4, 303-307, https://doi.org/10.1002/ffj.1282
. [all data]
Sacchetti, Medici, et al., 2004
Sacchetti, G.; Medici, A.; Maietti, S.; Radice, M.; Muzzoli, M.; Manfredini, S.; Braccioli, E.; Bruni, R.,
Composition and functional properties of the essential oil of Amazonian basil, Ocimum micranthum Willd., Labiatae in comparison with commercial essential oils,
J. Agric. Food Chem., 2004, 52, 11, 3486-3491, https://doi.org/10.1021/jf035145e
. [all data]
Mockute and Judzentiene, 2003
Mockute, D.; Judzentiene, A.,
Variability of the essential oils composition of Achillea millefolium ssp. millefolium growing wild in Lithuania,
Biochem. Syst. Ecol., 2003, 31, 9, 1033-1045, https://doi.org/10.1016/S0305-1978(03)00066-8
. [all data]
Azevedo, Campos, et al., 2002
Azevedo, N.R.; Campos, I.F.P.; Ferreira, H.D.; Portes, T.A.; Seraphin, J.C.; de Paula, J.R.; Santos, S.C.; Ferri, P.H.,
Essential oil chemotypes in Hyptis suaveolens from Brazilian Cerrado,
Biochem. Syst. Ecol., 2002, 30, 3, 205-216, https://doi.org/10.1016/S0305-1978(01)00075-8
. [all data]
Isidorov, Krajewska, et al., 2000
Isidorov, V.; Krajewska, U.; Bal, K.; Jaroszynska, J.; Niesluchowska, A.; Fuksman, I.,
GC-MS identification of multicomponent organic compounds mixtures using extra column phase equilibrium,
Chem. Anal. (Warsaw), 2000, 45, 513-520. [all data]
Lorenzo, Dellacassa, et al., 2000
Lorenzo, D.; Dellacassa, E.; Atti-Serafini, L.; Santos, A.C.; Frizzo, C.; Paroul, N.; Moyna, P.; Mondello, L.; Dugo, G.,
Composition and stereoanalysis of Cymbopogon winterianus Jowitt oil from Southern Brazil,
Flavour Fragr. J., 2000, 15, 3, 177-181, https://doi.org/10.1002/1099-1026(200005/06)15:3<177::AID-FFJ887>3.0.CO;2-M
. [all data]
Skocibusic, Bezic, et al., 2006
Skocibusic, M.; Bezic, N.; Dunkic, V.,
Phytochemical composition and antimicrobial activities of the essential oils from Satureja subspicata Vis. growing in Croatia,
Food Chem., 2006, 96, 1, 20-28, https://doi.org/10.1016/j.foodchem.2005.01.051
. [all data]
Lee, Lee, et al., 2005
Lee, J.-G.; Lee, C.-G.; Kwag, J.-J.; Buglass, A.J.; Lee, G.-H.,
Determination of optimum conditions for the analysis of volatile components in pine needles by double-shot pyrolysis-gas chromatography-mass spectrometry,
J. Chromatogr. A, 2005, 1089, 1-2, 227-234, https://doi.org/10.1016/j.chroma.2005.06.060
. [all data]
Skocibusic and Bezic, 2004
Skocibusic, M.; Bezic, N.,
Phytochemical Analysis and In vitro Antimicrobial Activity of Two Satureja Species Essential Oils,
Phytother. Res., 2004, 18, 12, 967-970, https://doi.org/10.1002/ptr.1489
. [all data]
Jerkovic, Mastelic, et al., 2003
Jerkovic, I.; Mastelic, J.; Milos, M.; Juteau, F.; Masotti, V.; Viano, J.,
Chemical variability of Artemisia vulgaris L. essential oils originated from the Mediterranean area of France and Croatia,
Flavour Fragr. J., 2003, 18, 5, 436-440, https://doi.org/10.1002/ffj.1246
. [all data]
Radonic and Milso, 2003
Radonic, A.; Milso, M.,
Chemical Composition and In Vitro Evaluation of Antioxidant Effect of Free Volatile Compounds From Satureja montana L.,
Free Radical Research, 2003, 37, 6, 673-679, https://doi.org/10.1080/1071576031000105643
. [all data]
Skocibusic and Bezic, 2003
Skocibusic, M.; Bezic, N.,
Chemical composition and antidiarrhoeal activities of winter savory (Satureja montana L.) essential oil,
Pharm. Biol., 2003, 41, 8, 622-626, https://doi.org/10.1080/13880200390502180
. [all data]
Milos, Radonic, et al., 2001
Milos, M.; Radonic, A.; Bezic, N.; Dunkic, V.,
Localities and seasonal variations in the chemical composition of essential oils of Satureja montana L. and S. cuneifolia Ten,
Flavour Fragr. J., 2001, 16, 3, 157-160, https://doi.org/10.1002/ffj.965
. [all data]
Brophy, Goldsack, et al., 2000
Brophy, J.J.; Goldsack, R.J.; Forster, P.I.,
Essential oils of the genus Lophostemon (Myrtaceae),
Flavour Fragr. J., 2000, 15, 1, 17-20, https://doi.org/10.1002/(SICI)1099-1026(200001/02)15:1<17::AID-FFJ859>3.0.CO;2-D
. [all data]
Brophy, Goldsack, et al., 2000, 2
Brophy, J.; Goldsack, R.J.; Bean, A.R.; Forster, P.I.; Lepschi, B.J.,
Leaf essential oils of the genus Leptospermum (Myrtaceae) in eastern Australia. Part 6. Leptospermum polygalifolium and allies,
Flavour Fragr. J., 2000, 15, 4, 271-277, https://doi.org/10.1002/1099-1026(200007/08)15:4<271::AID-FFJ910>3.0.CO;2-E
. [all data]
Brophy, Goldsack, et al., 2000, 3
Brophy, J.J.; Goldsack, R.J.; Punruckvong, A.; Bean, A.R.; Forster, P.I.; Lepschi, B.J.; Doran, J.C.; Rozefelds, A.C.,
Leaf essential oils of the genus Leptospermum (Myrtaceae) in eastern Australia. Part 7. Leptospermum petersonii, L. liversidgei and allies,
Flavour Fragr. J., 2000, 15, 5, 342-351, https://doi.org/10.1002/1099-1026(200009/10)15:5<342::AID-FFJ924>3.0.CO;2-V
. [all data]
Chagonda, Makanda, et al., 2000
Chagonda, L.S.; Makanda, C.D.; Chalchat, J.-C.,
The essential oils of Ocimum canum Sims (basilic camphor) and Ocimum urticifolia Roth from Zimbabwe,
Flavour Fragr. J., 2000, 15, 1, 23-26, https://doi.org/10.1002/(SICI)1099-1026(200001/02)15:1<23::AID-FFJ866>3.0.CO;2-W
. [all data]
Brophy, Goldsack, et al., 1999
Brophy, J.J.; Goldsack, R.J.; Punruckvong, A.; Forster, P.I.,
The leaf essential oils of Pilidiostigma (Myrtaceae),
Flavour Fragr. J., 1999, 14, 2, 143-146, https://doi.org/10.1002/(SICI)1099-1026(199903/04)14:2<143::AID-FFJ798>3.0.CO;2-P
. [all data]
Brophy, Goldsack, et al., 1999, 2
Brophy, J.J.; Goldsack, R.J.; Bean, A.R.; Forster, P.I.; Lepschi, B.J.,
Leaf essential oils of the genus Leptospermum (Myrtaceae) in eastern Australia. Part 5. Leptospermum continentale and allies,
Flavour Fragr. J., 1999, 14, 2, 98-104, https://doi.org/10.1002/(SICI)1099-1026(199903/04)14:2<98::AID-FFJ797>3.0.CO;2-V
. [all data]
Brophy, Forster, et al., 1998
Brophy, J.J.; Forster, P.I.; Goldsack, R.J.,
Esssential oils of some Australian monimiaceae,
Flavour Fragr. J., 1998, 13, 4, 273-276, https://doi.org/10.1002/(SICI)1099-1026(1998070)13:4<273::AID-FFJ745>3.0.CO;2-O
. [all data]
Brophy, Goldsack, et al., 1998
Brophy, J.J.; Goldsack, R.J.; Forster, P.I.; Bean, A.R.; Clarkson, J.R.; Lepschi, B.J.,
Leaf essential oils of the genus Leptospermum (Myrtaceae) in Eastern Australia. Part 1. Leptospermum brachyandrum and Leptospermum pallidum groups,
Flavour Fragr. J., 1998, 13, 1, 19-25, https://doi.org/10.1002/(SICI)1099-1026(199801/02)13:1<19::AID-FFJ679>3.0.CO;2-9
. [all data]
Brophy, Goldsack, et al., 1998, 2
Brophy, J.J.; Goldsack, R.J.; Bean, A.R.; Forster, P.I.; Lepschi, B.J.,
Leaf essential oils of the genus Leptospermum (Myrtaceae) in eastern Australia. Part 2. Leptospermum blakelyi and allies,
Flavour Fragr. J., 1998, 13, 5, 353-358, https://doi.org/10.1002/(SICI)1099-1026(1998090)13:5<353::AID-FFJ759>3.0.CO;2-1
. [all data]
Brophy, Goldsack, et al., 1997
Brophy, J.J.; Goldsack, R.J.; Forster, P.I.,
The essential oils of the Australian species of Rhodomyrtus (Myrtaceae),
Flavour Fragr. J., 1997, 12, 2, 103-108, https://doi.org/10.1002/(SICI)1099-1026(199703)12:2<103::AID-FFJ621>3.0.CO;2-B
. [all data]
Brophy, Goldsack, et al., 1997, 2
Brophy, J.J.; Goldsack, R.J.; Forster, P.I.,
The leaf essential oils of the Australian species of Rhodamnia (Myrtaceae),
Flavour Fragr. J., 1997, 12, 5, 345-354, https://doi.org/10.1002/(SICI)1099-1026(199709/10)12:5<345::AID-FFJ658>3.0.CO;2-6
. [all data]
Bisio, Ciarallo, et al., 1998
Bisio, A.; Ciarallo, G.; Romussi, G.; Fontana, N.; Mascolo, N.; Capasso, R.; Biscardi, D.,
Chemical Composition of Essential Oils from some Salvia species,
Phytother. Res., 1998, 12, S1, s117-s120, https://doi.org/10.1002/(SICI)1099-1573(1998)12:1+3.0.CO;2-2
. [all data]
Bendiabdellah, El Amine Dib, et al., 2012
Bendiabdellah, A.; El Amine Dib, M.; Djabou, N.; Allali, H.; Tabti, B.; Costa, J.; Myseli, A.,
Biological activities and volatile cinstituents of Daucus muricatus L. from Algeria,
Chem. Centr. J., 2012, 6, 48, 1-22. [all data]
Boukhris, Bouaziz, et al., 2012
Boukhris, M.; Bouaziz, M.; Feki, I.; Jemai, H.; El Feki, A.; Sayadi, S.,
Hypoglycemic and antioxidant effects of leaf essential oil of Pelargonium graveolens L'Her. in alloxan induced diabetic rats,
Lipids in Health and Disease, 2012, 11, 1, 1-10, https://doi.org/10.1186/1476-511X-11-81
. [all data]
Velickovic, Ristic, et al., 2012
Velickovic, D.T.; Ristic, M.S.; Karabegovic, I.T.; Stojicevic, S.S.; Lazic, M.L.,
The influence of the distillation method on the chemical composition of the essential oil of sage (Salvia officinalis L.),
Advanced Technologies, 2012, 1, 1, 47-51. [all data]
Vijayakumar, Duraipandiyan, et al., 2012
Vijayakumar, A.; Duraipandiyan, V.; Jeyarai, B.; Agastian, P.; Raj, M.K.; Ignacimunthu, S.,
Phytochemical analysis and in vitro antimicrobial activity of Illicium griffithii Hook f. Thoms extracts,
Asian Pacific J. Tropical Diseases, 2012, 2, 3, 190-199, https://doi.org/10.1016/S2222-1808(12)60045-0
. [all data]
Zouari, Ayadi, et al., 2012
Zouari, N.; Ayadi, I.; Fakhfakh, N.; Rebai, A.; Zouari, S.,
Variations of chemical composition of essential oils in wild-populations of Thymus algeriensis Boiss et Reut., a North African endemic species,
Lipids in Health and Desease, 2012, 11, 1, 28-39, https://doi.org/10.1186/1476-511X-11-28
. [all data]
Bertoli, Lepnardi, et al., 2011
Bertoli, A.; Lepnardi, M.; Krzyzanowska, J.; Oleszek, W.; Pistelli, L.,
Mentha longifolia in vitro cultures as safe source of flavouring ingradients,
Acta Biochem. Polonica, 2011, 58, 4, 581-587. [all data]
Hammami, Kamoun, et al., 2011
Hammami, I.; Kamoun, N.; Rebai, A.,
Biocontrol of Botrytis cinerea with essential oil and methanol extract of Viola odorata flowers,
Archives of Appl. Sci. Res., 2011, 3, 5, 44-51. [all data]
Karimi, Farmani, et al., 2011
Karimi, H.; Farmani, A.; Nourizadeh, H.,
A performance comparison of modern statistical technique for molecular descriptor selection and retention prediction of essential oil from leaves,
Amer. J. Sci. Res., 2011, 38, 36-40. [all data]
Zarai, Kadri, et al., 2011
Zarai, Z.; Kadri, A.; Ben Chobba, I.; Ben Mansour, R.; Bekir, R.; Mejdoub, H.; Gharsallah, N.,
The in-vitro evaluation of antibacterial, antifungal and cytotoxic properties of Marrubium vulgare L. essential oil grown in Tunisia,
Lipids in Health and Disease, 2011, 10, 161, 1-8. [all data]
Cavar, Maksimovic, et al., 2010
Cavar, S.; Maksimovic, M.; Solic, M.E.,
Comparison of essential oil composition of Stachys menthufolia Vis. from two natural habitas in Croatia,
Biologica Nyssana, 2010, 1, 1-2, 99-103. [all data]
Dib, Djabou, et al., 2010
Dib, M.ElA.; Djabou, N.; Desjobert, L.-M.; Allali, H.; Tabti, B.; Muselli, A.; Costa, J.,
Characterization of volatile compounds of Daucus crinitus Desf. headspace solid phase microextraction as alternative technique to hydrodistillation,
Chem, Centr. J., 2010, 4, 16, 1-15. [all data]
Kahriman, Tosun, et al., 2010
Kahriman, N.; Tosun, G.; Genc, H.; Yayli, N.,
Comparative essential oil analysis of Geranium sylvaticum estracted by hydrodistillation and microwave distillation,
Turk. J. Chem., 2010, 34, 969-976. [all data]
Lazarevic, Palic, et al., 2010
Lazarevic, J.S.; Palic, R.V.M.; Radulovic, N.S.; Ristic, N.R.; Stojanovic, G.S.,
Chemical composition and screening of the antimicrobial and antioxidative acrivity of extracts of Stachys species,
J. Serb. Chem. Soc., 2010, 75, 10, 1347-1359, https://doi.org/10.2298/JSC100601117L
. [all data]
Magalhaes, Lima, et al., 2010
Magalhaes, L.A.M.; Lima, M. daP.; Marques, M.O.M.; Facanali, R.; Pinto, A.C. daS.; Tadei, W.P.,
Chemical composition and larvicidal activity against Aedes aegypti Larvae of essential oils from four Guarea species,
Molecules, 2010, 15, 8, 5734-5741, https://doi.org/10.3390/molecules15085734
. [all data]
Mesa-Arango, Betancur-Galvis, et al., 2010
Mesa-Arango, A.C.; Betancur-Galvis, L.; Montiel, J.; Bueno, J.G.; Baena, A.; Duran, D.C.; Martinez, J.R.; Stashenko, E.E.,
Antifungal activity and chemical composition of the essential oils of Lippia alba (Miller) N.E. Brown grown in different regions of Colombia,
J. Essential Oil Res., 2010, 22, 6, 568-574, https://doi.org/10.1080/10412905.2010.9700402
. [all data]
Neves, Rosa, et al., 2010
Neves, A.; Rosa, S.; Goncalves, J.; Rufino, A.; Judas, F.; Salgueiro, L.; Lopes, M.C.; Cavaleiro, C.; Mendes, A.F.,
Screening of five essential oils for identification of potential inhibitors of IL-1-unduced Nf-kB activation and NO production in human clondrocytes: characterization of the inhibitory activity of alpha-pinene,
Plante Med., 2010, 76, 03, 303-308, https://doi.org/10.1055/s-0029-1186085
. [all data]
Ogunwande, Flamini, et al., 2010
Ogunwande, I.A.; Flamini, G.; Cioni, P.L.; Omikorede, O.; Azeez, R.A.; Ayodele, A.A.; Kamil, Y.O.,
Aromatic plants growing in Nigeria: essential oil constituents of Cassia alata (Linn.) Roxb. and Helianthus annuus L.,
Rec. Nat. Prod., 2010, 4, 4, 211-217. [all data]
Pripdeevech, Chumpolsri, et al., 2010
Pripdeevech, P.; Chumpolsri, W.; Suttiarporn, P.; Wongpornchai, S.,
The chemical composition and antioxidant activities of Basil from Thailand using retention indices and comprehensive two-dimensional gas chromatography,
J. Seb. Chem. Soc., 2010, 75, 11, 1503-1513, https://doi.org/10.2298/JSC100203125P
. [all data]
Radulovic, Dordevic, et al., 2010
Radulovic, N.S.; Dordevic, N.D.; Palic, R.M.,
Volatiles of Pleurospermum austriacum (L.) Hoffm. (Apiaceae),
J. Serbian Chem. Soc., 2010, 75, 12, 1-11, https://doi.org/10.2298/JSC100323127R
. [all data]
Radulovic, Dordevic, et al., 2010, 2
Radulovic, N.; Dordevic, N.; Markovic, M.; Palic, R.,
Volatile constituents of Glechoma Hirsuta Waldst. Kit. and G. Hederacea L. (Lamiaceae),
Bull. Chem. Soc. Ethiop., 2010, 24, 1, 67-76, https://doi.org/10.4314/bcse.v24i1.52962
. [all data]
Xu, Tang, et al., 2010
Xu, X.; Tang, Z.; Liang, Y.,
Comparative analysis of plant essential oils by GC-MS coupled with integrated chemometric resolution methods,
Anal. Methods, 2010, 2, 4, 359-367, https://doi.org/10.1039/b9ay00213h
. [all data]
Alim, Goze, et al., 2009
Alim, A.; Goze, I.; Cetin, A.; Atas, A.; Vural, N.; Donmez, E.,
Antimicrobial activity of the essential oil of Cyclotrichimun niveum (Boiss.) Manden. Et Scheng,
African J. Microbiol. Res., 2009, 3, 8, 422-425. [all data]
Benites, Moiteiro, et al., 2009
Benites, J.; Moiteiro, C.; Miguel, G.; Rojo, L.; Lopez, J.; Venancio, F.; Ramalho, L.; Feio, S.; Dandlen, S.; Casanova, H.; Torres, I.,
Composition and biological activity of the essential oil of Peruvial Lantana camara,
J. Chilean Chem. Soc., 2009, 54, 4, 379-384, https://doi.org/10.4067/S0717-97072009000400012
. [all data]
Dayisoylu and Alma, 2009
Dayisoylu, K.S.; Alma, M.H.,
Chemical analysis of essential oils from cone's rosin of Cilician fir (Abies cilicica subsp. cilicica),
Afr. J. Biotechnol., 2009, 8, 15, 3502-3505. [all data]
El-Massry, El-Ghorab, et al., 2009
El-Massry, K.F.; El-Ghorab, A.H.; Shaaban, H.A.; Shibamoto, T.,
Chemical compositions and antioxidant/antimicrobial activities of various samples prepared from Schinus terebinthifolius leaves cultivated in Egipt,
J. Agric. Food Chem., 2009, 57, 12, 5265-5270, https://doi.org/10.1021/jf900638c
. [all data]
Gilani, Shah, et al., 2009
Gilani, A.H.; Shah, A.J.; Zubair, A.; Khalid, S.; Kiani, J.; Ahmed, A.; Rasheed, M.; Ahmad, V.U.,
Chemical composition and mechanisms underlying the spasmolytic and bronchodilatory properties of the essential oil of Nepeta cataria L.,
J. Ethnopharmacology, 2009, 121, 3, 405-411, https://doi.org/10.1016/j.jep.2008.11.004
. [all data]
Ho, Wang, et al., 2009
Ho, C.-L.; Wang, E.I.-C.; Su, Y.-C.,
Essential oil compositions and bioactivities of the various parts of Cinnamomum camphora Sieb. var. linallolifera Fujuta,
Journal title only in Chinese, 2009, 31, 2, 77-96. [all data]
Maridass, 2009
Maridass, M.,
Inter-generic relationships of Ocimum and Origanum based on GC-MS volatile oils data using software NTSPSpc version 2.0,
Ethnobotanical Leaflets, 2009, 13, 83-88. [all data]
Museli, Pau, et al., 2009
Museli, A.; Pau, M.; Desjobert, J.-M.; Foddai, M.; Usai, M.; Costa, J.,
Volatile constituents of Achllea ligustica All. by HS-SPME/GC/GC-MS. Comparison with essential oils obtained by hydrodistillation from Corsica and Sardinia,
Chromatographia, 2009, 69, 5/6, 575-585, https://doi.org/10.1365/s10337-008-0939-1
. [all data]
Porto, Decorti, et al., 2009
Porto, C.Da.; Decorti, D.; Kikic, I.,
Flavour compounds of Lavandula angustifolia L. to use in food manufacturing: comparison of three different extraction methods,
Food Chem., 2009, 112, 4, 1072-1078, https://doi.org/10.1016/j.foodchem.2008.07.015
. [all data]
Rahimi-Nasrabadi, Gholivand, et al., 2009
Rahimi-Nasrabadi, M.; Gholivand, M.B.; Batooli, H.; Vatanara, A.,
Chemical composition of the essential oil from leaves and flowering aerial parts of Psammogeton canscens (DC). Vake from Iran,
J. Medicinal Plants, 2009, 8, 31, 82-86. [all data]
Scrivanti, Anton, et al., 2009
Scrivanti, L.R.; Anton, A.M.; Zygadlo, J.A.,
Essential oil conposition of Bothriochloa Kuntze (Poaceae) from South America and their chemotaxonomy,
Biochem. Systematics Ecol., 2009, 37, 3, 206-213, https://doi.org/10.1016/j.bse.2009.03.009
. [all data]
Su, Wang, et al., 2009
Su, Y.; Wang, C.; Yinlong, G.,
Analysis of volatile compounds from Mentha hapioealyx Briq. by GC-MS based on accurate mass measurements and retention indices,
Acta Chem. Sinica, 2009, 67, 6, 546-554. [all data]
Zhao, Zeng, et al., 2009
Zhao, C.; Zeng, Y.; Wan, M.; Li, R.; Liang, Y.; Li, C.; Zeng, Z.; Chau, F.-T.,
Comparative analysis of essential oils from eight herbal medicines with pungent flavor and cool nature by GC-MS and chemometric resolution methods,
J. Sep. Sci., 2009, 32, 4, 660-670, https://doi.org/10.1002/jssc.200800484
. [all data]
Djarri, Medjroubi, et al., 2008
Djarri, L.; Medjroubi, K.; Akkai, S.; Elomri, A.; Seguin, E.; Groult, M.-L.; Verite, P.,
Variability of two essential olis of Kundmannia sicula (L.) DC., a traditional Algerian medicinal plant,
Molecules, 2008, 13, 4, 812-817, https://doi.org/10.3390/molecules13040812
. [all data]
Flamini, Tebano, et al., 2008
Flamini, G.; Tebano, M.; Cioni, P.L.,
Composition of the essential oils from leafy parts of the shoots, flowers and fruits of Eryngium amethystinum from Amiata Mount (Tuscany, Italy),
Food Chem., 2008, 107, 2, 671-674, https://doi.org/10.1016/j.foodchem.2007.08.064
. [all data]
Lo Presti, Sciarrone, et al., 2008
Lo Presti, M.; Sciarrone, D.; Crupi, M.C.; Costa, R.; Ragusa, S.; Dugo, G.; Mondello, L.,
Evaliation of the volatile and chiral composition in Pistacia lentiscus L. essential oil,
Flavour Fragr. J., 2008, 23, 4, 249-257, https://doi.org/10.1002/ffj.1878
. [all data]
Paolini, Tomi, et al., 2008
Paolini, J.; Tomi, P.; Bernardini, A.-F.; Bradesi, P.; Casanova, J.; Kaloustian, J.,
Detailed analysis of the essential oil from Cistus albidus L. by combination of GC/RI, GC/MS and 13C-NMR spectroscopy,
N.Z. J. Agric. Res., 2008, 22, 14, 1270-1278. [all data]
Skalicka-Wozniak, Los, et al., 2008
Skalicka-Wozniak, K.; Los, R.; Glowniak, K.; Malm, A.,
Variation of the volatile content of the fruits of Peucedanum alsaticum L.,
Acta Chromatographica, 2008, 20, 1, 119-133, https://doi.org/10.1556/AChrom.20.2008.1.10
. [all data]
Yassa and Akhani, 2008
Yassa, N.; Akhani, H.,
The essential oils composition in two species of the genus Eriocycla Lindl. (Apiaceae) from Iran, 2008, retrieved from http://biology.ut.ac.ir/members/akhani/PdfReprintNumber/27.pdf. [all data]
Amiri, 2007
Amiri, H.,
Quantative and qualative changes of essential oil of Salvia bracteata BAnk et Sol. in different growth stages,
DARU, 2007, 15, 2, 79-82. [all data]
Bos, Woerdenbag, et al., 2007
Bos, R.; Woerdenbag, H.J.; Kayser, O.; Quax, W.J.; Ruslan, K.; Elfami,
Essential oil constituents of Piper cubeba L. fils. from Indonesia,
J. Essent. Oil Res., 2007, 19, 1, 14-17, https://doi.org/10.1080/10412905.2007.9699217
. [all data]
Capetanos, Saroglou, et al., 2007
Capetanos, C.; Saroglou, V.; Marin, P.D.; Simic, A.; Skaltsa, H.D.,
Essential oil snalysis of two endemic Eringium species from Serbia,
J. Serb. Chem. Soc., 2007, 72, 10, 961-965, https://doi.org/10.2298/JSC0710961C
. [all data]
Cheraif, Ben Jannet, et al., 2007
Cheraif, I.; Ben Jannet, H.; Hammami, M.; Khouja, M.L.; Mighri, Z.,
Chemical composition and antimicrobial activity of essential oils of Cupressus arizonica Greene,
Biochem. Syst. Ecol., 2007, 35, 12, 813-820, https://doi.org/10.1016/j.bse.2007.05.009
. [all data]
Elfami, Bos, et al., 2007
Elfami; Bos, R.; Ruslan, K.; Woerdenbag, H.J.; Kayser, P.; Quax, W.J.,
Essential Oil Constituents of Piper cubeba from Indonesia, 2007, 53-60. [all data]
Füssel, Dötterl, et al., 2007
Füssel, U.; Dötterl, S.; Jürgens, A.; Aas, G.,
Inter- and intraspecific variation in floral scent in the genus Salix and its implication for pollination,
J. Chem. Ecol., 2007, 33, 4, 749-765, https://doi.org/10.1007/s10886-007-9257-6
. [all data]
Ghasempour, Shirinpour, et al., 2007
Ghasempour, H.R.; Shirinpour, E.; Heidari, H.,
The constituents of essential oils of Ferulago angulata (Schlecht.) Boiss at two different habitats, Nevakoh and Shahoo, Agross mountain, Western Iran,
Iranian J. Sci. Technol., 2007, 31, A3, 309-312. [all data]
Gudaityte and Venskutonis R.P., 2007
Gudaityte, O.; Venskutonis R.P.,
Chemotypes of Achillea millefolium transferred from 14 different locations in Lithuania to the controlled environment,
Biochem. Syst. Ecol., 2007, 35, 9, 582-592, https://doi.org/10.1016/j.bse.2007.03.016
. [all data]
Kiran, Devi, et al., 2007
Kiran, S.R.; Devi, P.S.; Reddy, K.J.,
Bioactivity of essential oils and sesquiterpenes of Chloroxylon swietenia DC against Helicoverpa armigera,
Current Science, 2007, 93, 4, 544-548. [all data]
Mohottalage, Tabacchi, et al., 2007
Mohottalage, S.; Tabacchi, R.; Guerin, P.M.,
Components from Sri Lankan Piper betle L. leaf oil and their analogues showing toxicity against the housefly, Musca domestica,
Flavour Fragr. J., 2007, 22, 2, 130-138, https://doi.org/10.1002/ffj.1770
. [all data]
Monser-Esfahani, Karamkhani, et al., 2007
Monser-Esfahani, H.R.; Karamkhani, F.; Nickavar, B.; Abdi, K.; Faramarzi, M.A.,
The Volatile Constituents of Dracocephalum kotschyi Oils,
Chem. Nat. Comp., 2007, 43, 1, 40-43, https://doi.org/10.1007/s10600-007-0027-z
. [all data]
Morteza-Semnani, Saeedi, et al., 2007
Morteza-Semnani, K.; Saeedi, M.; Akbarzadeh, M.,
Essential oil composition of Teucrium scordium L.,
Acta Pharm., 2007, 57, 4, 499-504, https://doi.org/10.2478/v10007-007-0040-6
. [all data]
Pinto, Salgueiro, et al., 2007
Pinto, E.; Salgueiro, L.R.; Cavaleiro, C.; Palmeira, A.; Goncalves, M.J.,
In vitro susceptibility of some species of yeasts and filamentous fungi to essential oils of Salvia of?cinalis,
Ind. Crops Prod., 2007, 26, 2, 135-141, https://doi.org/10.1016/j.indcrop.2007.02.004
. [all data]
Reza, Ebrahim, et al., 2007
Reza, G.H.; Ebrahim, S.; Hossein, H.,
Analysis by gas chromatography - mass spectrometry of essential oil from seeds and aerial parts of Ferulago angulata (Schlecht.) Boiss gatheres in Nevakoh and Shahoo, Zagross mountain, west of Iran,
Pakistan J. Biol. Sci., 2007, 10, 5, 814-817, https://doi.org/10.3923/pjbs.2007.814.817
. [all data]
Sonboli, Kanani, et al., 2007
Sonboli, A.; Kanani, M.R.; Yousefzadi, M.; Mojarrad, M.,
Biological activity and composition of the essential oil of Tetrataenium nephrophyllum (Apiaceae) from Iran,
Natural Product Communications, 2007, 2, 12, 1249-1252. [all data]
Sylvestre, Longtin, et al., 2007
Sylvestre, M.; Longtin, A.P.A.; Legault, J.,
Volatile leaf condtituents and anticancer activity of Bursera simaruba (L.) Sarg. essential oil,
Natural Product Communications, 2007, 2, 12, 1273-1276. [all data]
Tava, Pecetti, et al., 2007
Tava, A.; Pecetti, L.; Ricci, M.; Pagnotta, M.A.; Russi, L.,
Volatile compounds from leaves and flowers of Bituminaria bituminosa (L.) Stirt. (Fabaceae) from Italy,
Flavour Fragr. J., 2007, 22, 5, 363-370, https://doi.org/10.1002/ffj.1806
. [all data]
Tzakou, Bazos, et al., 2007
Tzakou, O.; Bazos, I.; Yannitsaros, A.,
Volatile metabolites of Pistacia atlantica Desf. from Greece,
Flavour Fragr. J., 2007, 22, 5, 358-362, https://doi.org/10.1002/ffj.1805
. [all data]
Vagionas, Graikou, et al., 2007
Vagionas, K.; Graikou, K.; Ngassapa, O.; Runyoro, D.; Chinou, I.,
Composition and antimicrobial activity of the essential oils of three Satureja species growing in Tansania,
Food Chem., 2007, 103, 2, 319-324, https://doi.org/10.1016/j.foodchem.2006.07.051
. [all data]
Wenguang, Wenlai, et al., 2007
Wenguang, J.; Wenlai, F.; Yan, X.; Guangao, Z.; Jiming, L.; Ying, Y.,
Analysis of free terpenoids in four Vitis vinifera varietis using solvent assisted flavour evaporation and gas chromatography-tandem mass spectrometry,
Chinese J. Chromatogr., 2007, 25, 6, 881-886, https://doi.org/10.1016/S1872-2059(08)60006-1
. [all data]
Yassa and Akhani, 2007
Yassa, N.; Akhani, H.,
The essential oils composition in two species of the genus Eriocycla Lindl. (Apiaceae) from Iran, 2007, retrieved from http://biology.ut.ac.ir/members/akhani/PdfReprintNumber/27.pdf. [all data]
Apel, Sobral, et al., 2006
Apel, M.A.; Sobral, M.; Zuanazzi, J.A.S.; Henriques, A.T.,
Essential oil composition of four Plinia species (Myrtaceae),
Flavour Fragr. J., 2006, 21, 3, 565-567, https://doi.org/10.1002/ffj.1638
. [all data]
Ayoub, Al-Azizi, et al., 2006
Ayoub, N.; Al-Azizi, M.; König, W.; Kubeczka, K.-H.,
Essential oils and a novel polyacetylene from Eryngium yuccifolium Michaux. (Apiaceae),
Flavour Fragr. J., 2006, 21, 6, 864-868, https://doi.org/10.1002/ffj.1631
. [all data]
Castel, Fernandez, et al., 2006
Castel, C.; Fernandez, X.; Lizzani-Cuvelier, L.; Perichet, C.; Lavoine, S.,
Characterization of the Chemical Composition of a Byproduct from Siam Benzoin Gum,
J. Agric. Food Chem., 2006, 54, 23, 8848-8854, https://doi.org/10.1021/jf061193y
. [all data]
Ebrahim Sajjadi and Mehregan, 2006
Ebrahim Sajjadi, S.; Mehregan, I.,
Volatile constituents of flowers and leaves of Anthemis hyalina,
Chem. Nat. Compd. (Engl. Transl.), 2006, 42, 5, 531-533, https://doi.org/10.1007/s10600-006-0207-2
. [all data]
Elfami, Komar, et al., 2006
Elfami, R.B.; Komar, R.; Woerdenbag, H.J.; Kayser, P.; Quax, W.J.,
Essential oil constituents of Piper cubeba from Indonesia, 2006, retrieved from http://dissertations.ub.rug.nl/FILES/facultiew/science/2006/elfahmi/05c5.pdf. [all data]
Figuérédo, Cabassu, et al., 2006
Figuérédo, G.; Cabassu, P.; Chalchat, J.-C.; Pasquier, B.,
Studies of Mediterranean oregano populations. VIII. Chemical composition of essential oils of oreganos of various origins,
Flavour Fragr. J., 2006, 21, 1, 134-139, https://doi.org/10.1002/ffj.1543
. [all data]
Gohari, Hadjiakhoondi, et al., 2006
Gohari, A.R.; Hadjiakhoondi, A.; Sadat-Ebrahimi, E.; Saeidnia, S.; Shafiee, A.,
Composition of the volatile oils of Satureja spicigera C. Koch Boiss. and S. macrantha C. A. Mey from Iran,
Flavour Fragr. J., 2006, 21, 2, 348-350, https://doi.org/10.1002/ffj.1642
. [all data]
Gohari A.R., Hadjiakhoondi A., et al., 2006
Gohari A.R.; Hadjiakhoondi A.; Sadat-Ebrahimi E.; Saeidnia S.; Shafiee A.,
Composition of the volatile oils of Satureja spicigera C. Koch Boiss. and S-macrantha C. A. Mey from Iran,
Flavour Fragr. J., 2006, 21, 3, 510-512, https://doi.org/10.1002/ffj.1613
. [all data]
Kiran, Bhavani, et al., 2006
Kiran, S.R.; Bhavani, K.; Devi, P.S.; Rao, B.R.R.; Reddy, K.J.,
Composition and alrvicidal activity of leaves and stem essential oils of Chloroxylon swietenia DC against Aedes aegypti and Anopheles stephensi,
Biores. Technol., 2006, 97, 18, 2481-2484, https://doi.org/10.1016/j.biortech.2005.10.003
. [all data]
Kucuk, Gulec, et al., 2006
Kucuk, M.; Gulec, C.; Yasar, A.; Ucuncu, O.; Yayh, N.; Coskuncelebi, K.; Terzioglu, S.; Yayh, N.,
Chemical composition and antimicrobial activities of the essential oils of Teucrium chamaedrys subsp. chamaedrys, T. orientale var. puberulens, and T. chamaedrys subsp. lydium,
Pharm. Biol., 2006, 44, 8, 592-599, https://doi.org/10.1080/13880200600896868
. [all data]
Lis and Milczarek, 2006
Lis, A.; Milczarek, J.,
Chemical composition of the essential oils from fruits, leaves and flowers of Phellodendron sachalinense (Fr. Schmidt) Sarg.,
Flavour Fragr. J., 2006, 21, 4, 683-686, https://doi.org/10.1002/ffj.1662
. [all data]
Marongiu, Piras, et al., 2006
Marongiu, B.; Piras, A.; Porcedda, S.; Tuveri, E.; Maxia, A.,
Isolation of Seseli bocconi Guss. volatile oil by supercritical carbon dioxide extraction,
Natural Product Research, 2006, 20, 9, 820-826, https://doi.org/10.1080/14786410500364684
. [all data]
Moody, Gundidza, et al., 2006
Moody, J.O.; Gundidza, M.; Wyllie, G.,
Essential oil composition of Leucas milanjiana Guerke,
Flavour Fragr. J., 2006, 21, 6, 872-874, https://doi.org/10.1002/ffj.1669
. [all data]
Morteza-Semnani, Akbarzadeh, et al., 2006
Morteza-Semnani, K.; Akbarzadeh, M.; Changizi, S.,
Essential oils composition of Stachys byzantina, S. inflata, S. lavandulifolia and S. laxa from Iran,
Flavour Fragr. J., 2006, 21, 2, 300-303, https://doi.org/10.1002/ffj.1594
. [all data]
Morteza-Semnani K., Akbarzadeh M., et al., 2006
Morteza-Semnani K.; Akbarzadeh M.; Moshiri K.,
The essential oil composition of Eupatorium cannabinum L. from Iran,
Flavour Fragr. J., 2006, 21, 3, 521-523, https://doi.org/10.1002/ffj.1687
. [all data]
Orav, Raal, et al., 2006
Orav, A.; Raal, A.; Arak, E.; Müürisepp, M.; Kailas, T.,
Composition of the essential oil of Artemisia absinthium L. of different geographical origin,
Proc. Est. Acad. Sci. Chem., 2006, 55, 3, 155-165. [all data]
Ouamba, Ouabonzi, et al., 2006
Ouamba, J.-M.; Ouabonzi, A.; Ekouya, A.; Bessière, J.-M.; Menut, C.; Abena, A.A.; Banzouzi, J.-T.,
Volatile constituents of the essential oil leaf of Lantana salvifolia Jacq. (Verbenaceae),
Flavour Fragr. J., 2006, 21, 1, 158-161, https://doi.org/10.1002/ffj.1553
. [all data]
Pala-Paul J., Perez-Alonso M.J., et al., 2006
Pala-Paul J.; Perez-Alonso M.J.; Velasco-Negueruela A.; Ballesteros M.T.; Sanz J.,
Essential oil composition of Sideritis hirsuta L. from Guadalajara Province, Spain,
Flavour Fragr. J., 2006, 21, 3, 410-415, https://doi.org/10.1002/ffj.1727
. [all data]
Petrovic, Ristic, et al., 2006
Petrovic, S.; Ristic, M.; Milenkovic, M.; Kukic, J.; Antic-Stankovic, J.; Niketic, M.,
Composition and antimicrobial activity of essential oil of Stachys plumosa Griseb.,
Flavour Fragr. J., 2006, 21, 2, 250-252, https://doi.org/10.1002/ffj.1570
. [all data]
Pintore G., Chessa M., et al., 2006
Pintore G.; Chessa M.; Manconi P.; Zanetti S.; Deriu A.; Tirillini B.,
Chemical composition and antimicrobial activities of essential oil of stachys glutinosa L. from Sardinia,
Natural Product Communications, 2006, 1, 12, 1133-1136. [all data]
Pino, Marbot, et al., 2006
Pino, J.A.; Marbot, R.; Payo, A.; Chao, D.; Herrera, P.,
Aromatic Plants from Western Cuba VII. Composition of the Leaf Oil of Psidium wrightii KRug et Urb., Lantana involucrata L., Cinnamonum montanum (Sw.) Berchtold et J. Persl. and Caesalpinia violacea (Mill.) Standley,
J. Essent. Oil. Res., 2006, 18, 2, 170-174, https://doi.org/10.1080/10412905.2006.9699058
. [all data]
Pitarokili, Tzakou, et al., 2006
Pitarokili, D.; Tzakou, O.; Loukis, A.,
Essential oil composition of Salvia verticillata, S. verbenaca, S. glutinosa and S. candidissima growing wild in Greece,
Flavour Fragr. J., 2006, 21, 4, 670-673, https://doi.org/10.1002/ffj.1647
. [all data]
Sefidkon, Jamzad, et al., 2006
Sefidkon, F.; Jamzad, Z.; Mirza, M.,
Chemical composition of the essential oil of five Iranian Nepeta species (N. crispa, N. mahanensis, N. ispahanica, N. eremophila and N. rivularis),
Flavour Fragr. J., 2006, 21, 5, 764-767, https://doi.org/10.1002/ffj.1668
. [all data]
Stojanovic, Palic, et al., 2006
Stojanovic, G.; Palic, I.; Ursic-Jankovic, J.,
Composition and antimicrobial activity of the essential oil of Micromeria cristata and Micromeria juliana,
Flavour Fragr. J., 2006, 21, 1, 77-79, https://doi.org/10.1002/ffj.1507
. [all data]
Tonzibo, Coffy, et al., 2006
Tonzibo, Z.F.; Coffy, A.A.; Chalachat, J.C.; N'guessan, Y.T.,
Chemical composition of essential oils of Hoslundia opposita Vahl. from Ivory Coast.,
Flavour Fragr. J., 2006, 21, 5, 789-791, https://doi.org/10.1002/ffj.1715
. [all data]
Tornambe, Cornu, et al., 2006
Tornambe, G.; Cornu, A.; Pradel, P.; Kondjoyan, N.; Carnat, A.P.; Petit, M.; Martin, B.,
Changes in Terpene Content in Milk from Pasture-Fed Cows,
J. Dairy Sci., 2006, 89, 6, 2309-2319, https://doi.org/10.3168/jds.S0022-0302(06)72302-5
. [all data]
Basta, Tzakou, et al., 2005
Basta, A.; Tzakou, O.; Couladis, M.,
Composition of the leaves essential oil of Melissa officinalis s. l. from Greece,
Flavour Fragr. J., 2005, 20, 6, 642-644, https://doi.org/10.1002/ffj.1518
. [all data]
Bos, Stojanova, et al., 2005
Bos, R.; Stojanova, A.; Woerdenbag, H.J.; Koulman, A.; Quax, W.J.,
Volatile components of the aerial parts of Artemisia pontica L. grown in Bulgaria,
Flavour Fragr. J., 2005, 20, 2, 145-148, https://doi.org/10.1002/ffj.1399
. [all data]
Chagonda and Chalchat, 2005
Chagonda, L.S.; Chalchat, J.-C.,
The essential oil of wild and cultivated Hoslundia opposita Vahl. from Zimbabwe,
Flavour Fragr. J., 2005, 20, 2, 193-195, https://doi.org/10.1002/ffj.1402
. [all data]
Chagonda and Chalchat, 2005, 2
Chagonda, L.S.; Chalchat, J.-C.,
The essential oil of the fruit of Garcinia huillensis Welw. ex. Oliv. from Zimbabwe,
Flavour Fragr. J., 2005, 20, 3, 313-315, https://doi.org/10.1002/ffj.1420
. [all data]
Chaverri and Cicció, 2005
Chaverri, C.; Cicció, J.F.,
Essential oil of trees of the genus Ocotea (Lauraceae) in Costa Rica. I. Ocotea brenesii,
Rev. Biol. Trop., 2005, 53, 3-4, 431-436, https://doi.org/10.15517/rbt.v53i3-4.14611
. [all data]
Chalchat and Özcan, 2005
Chalchat, J.-C.; Özcan, M.,
Constituents of the essential oil of Sideritis erythantha Boiss. Heldr. Var. erythrantha,
Gen. Appl. Plant Physiology, 2005, 31, 1-2, 65-70. [all data]
Cornu, Kondjoyan, et al., 2005
Cornu, A.; Kondjoyan, N.; Martin, B.; Verdier-Metz, I.; Pradel, P.; Berdague, J.-L.; Coulon, J.-B.,
Terpene profiles in Cantal and Saint-Nectairetype cheese made from raw or pasteurised milk,
J. Sci. Food Agric., 2005, 85, 12, 2040-2046, https://doi.org/10.1002/jsfa.2214
. [all data]
Duarte, Figueira, et al., 2005
Duarte, M.C.T.; Figueira, G.M.; Sartoratto, A.; Rehder, V.L.G.; Delarmelina, C.,
Anti-Candida activity of Brazilian medicinal plants,
J. Ethnopharmacol., 2005, 97, 2, 305-311, https://doi.org/10.1016/j.jep.2004.11.016
. [all data]
Facey, Porter, et al., 2005
Facey, P.C.; Porter, R.B.R.; Reese, P.B.; Williams, L.A.D.,
Biological activity and chemical composition of the essential oil from Jamaican Hyptis verticillata Jacq.,
J. Agric. Food Chem., 2005, 53, 12, 4774-4777, https://doi.org/10.1021/jf050008y
. [all data]
Figuérédo, Cabassu, et al., 2005
Figuérédo, G.; Cabassu, P.; Chalchat, J.-C.; Pasquier, B.,
Studies of Mediterranean oregano populations- V. Chemical composition of essential oils of oregano: Origanum syriacum L. var. bevanii (Holmes) Ietswaart, O. syriacum L. var. sinaicum (Boiss.) Ietswaart, and O. syriacum L. var. syriacum from Lebanon and Israel,
Flavour Fragr. J., 2005, 20, 164-168. [all data]
Jovanovic, Kitic, et al., 2005
Jovanovic, T.; Kitic, D.; Palic, R.; Stojanovic, G.; Ristic, M.,
Chemical composition and antimicrobial activity of the essential oil of Acinos arvensis (Lam.) Dandy from Serbia,
Flavour Fragr. J., 2005, 20, 3, 288-290, https://doi.org/10.1002/ffj.1409
. [all data]
Khanavi, Ghasemian, et al., 2005
Khanavi, M.; Ghasemian, L.; Motlagh, E.H.; Hadjiakhoondi, A.; Shafiee, A.,
Chemical composition of the essential oils of Marrubium parviflorum Fisch. C.A. Mey. and Marrubium vulgare L. from Iran,
Flavour Fragr. J., 2005, 20, 3, 324-326, https://doi.org/10.1002/ffj.1425
. [all data]
Khalighi-Sigaroodi, Hadijiakhoondi, et al., 2005
Khalighi-Sigaroodi, F.; Hadijiakhoondi, A.; Shahverdi, A.R.; Mozaffarian, V.-A.; Shafiee, A.,
Chemical composition and antimicrobial activity of the essential oil of Ferulago Bernardii Tomk. and M.Pimen.,
DARU, 2005, 13, 3, 100-104. [all data]
Kowalski and Wolski, 2005
Kowalski, R.; Wolski, T.,
The chemical composition of essential oils of Silphium perfoliatum L.,
Flavour Fragr. J., 2005, 20, 3, 306-310, https://doi.org/10.1002/ffj.1418
. [all data]
Kowalski, 2005
Kowalski, R.,
Analysis of lipophylic fraction from leaves, inflorescences and rhizomes of Siphium perfoliatum L.,
Acta Soc. Botanicorum Poloniae, 2005, 74, 1, 5-10, https://doi.org/10.5586/asbp.2005.001
. [all data]
Limberger, Sobral, et al., 2005
Limberger, R.P.; Sobral, M.; Henriques, A.T.,
Intraspecific volatile oil variation in Myrceugenia cucullata (Myrtaceae),
Biochem. Syst. Ecol., 2005, 33, 3, 287-293, https://doi.org/10.1016/j.bse.2004.10.002
. [all data]
Marongiu, Piras, et al., 2005
Marongiu, B.; Piras, A.; Porcedda, S.; Scorciapino, A.,
Chemical composition of the essential oil and supercritical CO2 extract of Commiphora myrrha (Nees) Engl. and of Acorus calamus L.,
J. Agric. Food Chem., 2005, 53, 20, 7939-7943, https://doi.org/10.1021/jf051100x
. [all data]
Morteza-Semnani, Akbarzadeh, et al., 2005
Morteza-Semnani, K.; Akbarzadeh, M.; Rostami, B.,
The essential oil composition of Teucrium chamaedrys L. from Iran,
Flavour Fragr. J., 2005, 20, 5, 544-546, https://doi.org/10.1002/ffj.1479
. [all data]
Morteza-Semnani and Saeedi, 2005
Morteza-Semnani, K.; Saeedi, M.,
The essential oil composition of Hypericum androsaemum L. leaves and flowers from Iran,
Flavour Fragr. J., 2005, 20, 3, 332-334, https://doi.org/10.1002/ffj.1432
. [all data]
Morteza-Semnani and Saeedi, 2005, 2
Morteza-Semnani, K.; Saeedi, M.,
The essential oil composition of Phlomis bruguieri Desf. from Iran,
Flavour Fragr. J., 2005, 20, 3, 344-346, https://doi.org/10.1002/ffj.1459
. [all data]
Najafpour Navaei, Mirza, et al., 2005
Najafpour Navaei, M.; Mirza, M.; Dini, M.,
Chemical composition of the essential oil of Plumbago europaea L. roots from Iran,
Flavour Fragr. J., 2005, 20, 2, 213-214, https://doi.org/10.1002/ffj.1384
. [all data]
Oyedeji, Yani, et al., 2005
Oyedeji, O.A.; Yani, V.V.; Afolayan, A.J.,
Chemical composition of the essential oil from Arctotis arctotoides (L.F.) O. Hoffm. (syn. Vendium arctotoides Less.),
Flavour Fragr. J., 2005, 20, 2, 232-234, https://doi.org/10.1002/ffj.1437
. [all data]
Pala-Paul, Perez-Alonso, et al., 2005
Pala-Paul, J.; Perez-Alonso, M.J.; Velasco-Negueruela, A.; Vadare, J.; Villa, A.M.; Sanz, J.; Brophy, J.J.,
Essential oil composition of the different parts of Eryngium bourgatii Gouan from Spain,
J. Chromatogr. A, 2005, 1074, 1-2, 235-239, https://doi.org/10.1016/j.chroma.2005.03.036
. [all data]
Petrakis, Roussis, et al., 2005
Petrakis, P.V.; Roussis, V.; Papadimitriou, D.; Vagias, C.; Tsitsimpikou, C.,
The effect of terpenoid extracts from 15 pine species on the feeding behavioural sequence of the late instars of the pine processionary caterpillar Thaumetopoea pityocampa,
Behav. Processes, 2005, 69, 3, 303-322, https://doi.org/10.1016/j.beproc.2004.12.008
. [all data]
Sajjadi S.E. and Eskandari B., 2005
Sajjadi S.E.; Eskandari B.,
Chemical constituents of the essential oil of Nepeta oxyodonta,
Chem. Nat. Compd. (Engl. Transl.), 2005, 41, 2, 175-177, https://doi.org/10.1007/s10600-005-0106-y
. [all data]
Sajjadi and Ghannadi, 2005
Sajjadi, S.-E.; Ghannadi, A.,
Essential oil of the Persian sage, Salvia rhytidea Benth.,
Acta Pharm. Sin., 2005, 55, 321-326. [all data]
Sajjadi, 2005
Sajjadi, S.E.,
Analysis of the essential oil of Nepeta sintenisii Bornm. from Iran,
DARU, 2005, 13, 2, 61-64. [all data]
Salehi, Sefidkon, et al., 2005
Salehi, P.; Sefidkon, F.; Bazzaz Tolami, L.; Sonboli, A.,
Essential oil composition of Salvia palaestina Benth. from Iran,
Flavour Fragr. J., 2005, 20, 5, 525-527, https://doi.org/10.1002/ffj.1448
. [all data]
Salehi, Sonboli, et al., 2005
Salehi, P.; Sonboli, A.; Eftekhar, F.; Nejad-Ebrahimi, S.; Yousefzadi, M.,
Essential Oil Composition, Antibacterial and Antioxidant Activity of the Oil and Various Extracts of Ziziphora clinopodioides subsp. rigida (BOISS.) RECH. f. from Iran,
Biol. Pharm. Bull., 2005, 28, 10, 1892-1896, https://doi.org/10.1248/bpb.28.1892
. [all data]
Sarkhail, Amin, et al., 2005
Sarkhail, P.; Amin, G.; Surmaghi, M.H.S.; Shafiee, A.,
Composition of the volatile oils of Phlomis lanceolata Boiss. Hohen., Phlomis anisodonta Boiss. and Phlomis bruguieri Desf. from Iran,
Flavour Fragr. J., 2005, 20, 3, 327-329, https://doi.org/10.1002/ffj.1427
. [all data]
Sefidkon and Jamzad, 2005
Sefidkon, F.; Jamzad, Z.,
Chemical composition of the essential oil of three Iranian Satureja species (S. mutica, S. macrantha and S. intermedia),
Food Chem., 2005, 91, 1, 1-4, https://doi.org/10.1016/j.foodchem.2004.01.027
. [all data]
Singh, Raina, et al., 2005
Singh, A.K.; Raina, V.K.; Naqvi, A.A.; Patra, N.K.; Kumar, B.; Ram, P.; Khanuja, S.P.S.,
Essential oil composition and chemoarrays of menthol mint (Mentha arvensis L. f. piperascens Malinvaud ex. Holmes) cultivars,
Flavour Fragr. J., 2005, 20, 3, 302-305, https://doi.org/10.1002/ffj.1417
. [all data]
Skoula and Grayer, 2005
Skoula, M.; Grayer, R.J.,
Volatile oils of Coridothymus capitatus, Satureja thymbra, Satureja spinosa and Thymbra calostachya (Lamiaceae) from Crete,
Flavour Fragr. J., 2005, 20, 6, 573-576, https://doi.org/10.1002/ffj.1489
. [all data]
Slavkovska, Couladis, et al., 2005
Slavkovska, V.; Couladis, M.; Bojovic, S.; Tzakou, O.; Pavlovic, M.; Lakusic, B.; Jancic, R.,
Essential oil and its systematic significance in species of Micromeria Bentham from Serbia Montenegro,
Plant Systematics and Evolution, 2005, 255, 1-2, 1-15, https://doi.org/10.1007/s00606-005-0303-y
. [all data]
Sonboli, Salehi, et al., 2005
Sonboli, A.; Salehi, P.; Allahyari, L.,
Essential oil composition of Nepeta involucrata from Iran,
Chem. Nat. Compd. (Engl. Transl.), 2005, 41, 6, 683-685, https://doi.org/10.1007/s10600-006-0011-z
. [all data]
Topçu, Barla, et al., 2005
Topçu, G.; Barla, A.; Gören, A.C.; Bilsel, G.; Bilsel, M.; Tümen, G.,
Analysis of the essential oil composition of Sideritis albiflora using direct thermal desorption and headspace GC-MS techniques,
Turk. J. Chem., 2005, 29, 525-529. [all data]
Tzakou and Constantinidis, 2005
Tzakou, O.; Constantinidis, T.,
Chemotaxonomic significance of volatile compounds in Thymus samius and its related species Thymus atticus and Thymus parnassicus,
Biochem. Syst. Ecol., 2005, 33, 11, 1131-1140, https://doi.org/10.1016/j.bse.2005.03.008
. [all data]
Velasco-Negueruela, Pérez-Alonso, et al., 2005
Velasco-Negueruela, A.; Pérez-Alonso, M.J.; Pérez de Paz, P.L.; Palá-Paúl, J.; Sanz, J.,
Analysis by gas chromatography-mass spectrometry of the essential oils from the aerial parts of Pimpinella anagodendron Bolle and Pimpinella rupicola Svent., two endemic species to the Canary Islands, Spain,
J. Chromatogr. A, 2005, 1095, 1-2, 180-184, https://doi.org/10.1016/j.chroma.2005.09.074
. [all data]
Aghel, Yamini, et al., 2004
Aghel, N.; Yamini, Y.; Hadjiakhoondi, A.; Pourmortazavi, S.M.,
Supercritical carbon dioxide extraction of Mentha pulegium L. essential oil,
Talanta, 2004, 62, 2, 407-411, https://doi.org/10.1016/j.talanta.2003.08.011
. [all data]
JAvidnia, Mojab, et al., 2004
JAvidnia, K.; Mojab, F.; Mojahedi, S.A.,
Chemical constituents of the essential oil of Stachys lavandulifolia Vahl from Iran,
Iranian J. Pharm. Res., 2004, 3, 61-63. [all data]
Kalemba and Thiem, 2004
Kalemba, D.; Thiem, B.,
Constituents of the essential oils of four micropropagated Solidago species,
Flavour Fragr. J., 2004, 19, 1, 40-43, https://doi.org/10.1002/ffj.1271
. [all data]
Limberger, Sobral, et al., 2004
Limberger, R.P.; Sobral, M.; Henriques, A.T.; Menut, C.; Bessière, J.-M.,
Óleos voláteis de espécies de Myrcia nativas do rio grande do sul,
Quim. Nova, 2004, 27, 6, 916-919, https://doi.org/10.1590/S0100-40422004000600015
. [all data]
Lopez Arze, Collin, et al., 2004
Lopez Arze, J.B.; Collin, G.; Garneau, F.-X.; Jean, F.-I.; Gagnon, H.,
Essential oils from Bolivia. II. Asteraceae: Ophryosporus heptanthus (Wedd.) H. Rob. et King,
J. Essent. Oil Res., 2004, 16, 4, 374-376, https://doi.org/10.1080/10412905.2004.9698747
. [all data]
Malencic, Couladis, et al., 2004
Malencic, Dj.; Couladis, M.; Mimica-Dukic, N.; Popovic, M.; Boza, P.,
Essential oils of three Salvia species from the Pannonian part of Serbia,
Flavour Fragr. J., 2004, 19, 3, 225-228, https://doi.org/10.1002/ffj.1291
. [all data]
Mehrabani, Asadipour, et al., 2004
Mehrabani, M.; Asadipour, A.; Amoli, S.S.,
Chemical constituents of the essential oil of NEPETA DEPAUPERATA BENTH. from Iran,
DARu: Journal of Faculty of Pharmacy, 2004, 12, 98-100. [all data]
Nik, Mirza, et al., 2004
Nik, Z.B.; Mirza, M.; Shahmir, F.,
Essential oil of Marrubium cuneatum Russell and its secretory elements,
Flavour Fragr. J., 2004, 19, 3, 233-235, https://doi.org/10.1002/ffj.1293
. [all data]
Palá-Paúl, Velasco-Negueruela, et al., 2004
Palá-Paúl, J.; Velasco-Negueruela, A.; Pérez-Alonso, M.J.; Maqueda, J.; Sanz, J.,
Volatile oil constituents from different parts of Cachrys trifida L.,
J. Essent. Oil Res., 2004, 16, 4, 347-349, https://doi.org/10.1080/10412905.2004.9698738
. [all data]
Raal, Paaver, et al., 2004
Raal, A.; Paaver, U.; Arak, E.; Orav, A.,
Content and composition of the essential oil of Thymus serpyllum L. growing wild in Estonia,
Medicina (Kaunas), 2004, 40, 8, 795-800. [all data]
Sarkhail, Amin, et al., 2004
Sarkhail, P.; Amin, G.; Shafiee, A.,
Composition of the essential oil of Phlomis persica Boiss and Phlomis chorassanica Bunge from Iran,
Flavour Fragr. J., 2004, 19, 6, 538-540, https://doi.org/10.1002/ffj.1338
. [all data]
Sefidkon and Shaabani, 2004
Sefidkon, F.; Shaabani, A.,
Essential oil composition of Nepeta meyeri Benth. from Iran,
Flavour Fragr. J., 2004, 19, 3, 236-238, https://doi.org/10.1002/ffj.1294
. [all data]
Tirillini, Pellegrino, et al., 2004
Tirillini, B.; Pellegrino, R.; Bini, L.M.,
Essential oil composition of Stachys sylvatica L. from Italy,
Flavour Fragr. J., 2004, 19, 4, 330-332, https://doi.org/10.1002/ffj.1308
. [all data]
Vilaseca, Guy, et al., 2004
Vilaseca, A.; Guy, I.; Charles, B.; Guinaudeau, H.; de Arias, A.R.; Fournet, A.,
Chemical composition and insecticidal activity of Hedeoma mandoniana essential oils,
J. Essent. Oil Res., 2004, 16, 4, 380-383, https://doi.org/10.1080/10412905.2004.9698749
. [all data]
Couladis, Özcan, et al., 2003
Couladis, M.; Özcan, M.; Tzakou, O.; Akgül, A.,
Comparative essential oil composition of various parts of the turpentine tree (Pistacia terebinthus L) growing wild in Turkey,
J. Sci. Food Agric., 2003, 83, 2, 136-138, https://doi.org/10.1002/jsfa.1295
. [all data]
Feizbaksh, Saber Tehrani, et al., 2003
Feizbaksh, A.; Saber Tehrani, M.; Rustaiyan, A.; Masoudi, S.,
Composition of the essential oil of Stachys lavandulifolia Vahl. from Iran,
J. Essent. Oil Res., 2003, 15, 2, 72-73, https://doi.org/10.1080/10412905.2003.9712068
. [all data]
Fekam Boyom, Ngouana, et al., 2003
Fekam Boyom, F.; Ngouana, V.; Amvam Zollo, P.H.; Menut, C.; Bessiere, J.M.; Gut, J.; Rosenthal, P.J.,
Composition and anti-plasmodial activities of essential oils from some Cameroonian medicinal plants,
Phytochemistry, 2003, 64, 7, 1269-1275, https://doi.org/10.1016/j.phytochem.2003.08.004
. [all data]
Ghannadi, Aghazari, et al., 2003
Ghannadi, A.; Aghazari, F.; Mehrabani, M.; Mohagheghzadeh, A.; Mehregan, I.,
Quantity and composition of the SDE prepared essential oil of Nepeta macrosiphon Boiss,
Iran. J. Pharm. Res., 2003, 2, 103-105. [all data]
Ghasemi, Asghari, et al., 2003
Ghasemi, N.; Asghari, G.; Ardakani, M.S.; Siahpoush, A.,
Characterization of volatile constituents from aerial parts of varthemia persica DC (var. persica),
Iran. J. Pharm. Res., 2003, 2, 241-243. [all data]
Ghannadi and Zolfaghari, 2003
Ghannadi, A.; Zolfaghari, B.,
Compositional analysis of the essential oil of Lallemantia royleana (Benth. in Wall.) Benth. from Iran,
Flavour Fragr. J., 2003, 18, 3, 237-239, https://doi.org/10.1002/ffj.1215
. [all data]
Jirovetz, Buchbauer, et al., 2003
Jirovetz, L.; Buchbauer, G.; Shafi, M.P.; Kaniampady, M.M.,
Chemotaxonomical analysis of the essential oil aroma compounds of four different Ocimumspecies from southern India,
Eur. Food Res. Technol., 2003, 217, 2, 120-124, https://doi.org/10.1007/s00217-003-0708-1
. [all data]
Jirovetz, Buchbauer, et al., 2003, 2
Jirovetz, L.; Buchbauer, G.; Shafi, M.P.; Leela, N.K.,
Analysis of the essential oils of the leaves, stems, rhizomes and roots of the medicinal plant Alpinia galanga from southern India,
Acta Pharm. Hung., 2003, 53, 73-81. [all data]
Juteau, Jerkovic, et al., 2003
Juteau, F.; Jerkovic, I.; Masotti, V.; Milos, M.; Mastelic, J.; Bessière, J.-M.; Viano, J.,
Composition and antimicrobial activity of the essential oil of Artemisia absinthium from Croatia and France,
Planta Medica, 2003, 69, 2, 158-161, https://doi.org/10.1055/s-2003-37714
. [all data]
Khanavi, Hadjiakhoondi, et al., 2003
Khanavi, M.; Hadjiakhoondi, A.; Shafiee, A.; Masoudi, S.; Rustaiyan, A.,
Chemical composition of the essential oil of Stachys byzanthin C. Koch. from Iran,
J. Essent. Oil Res., 2003, 15, 2, 77-78, https://doi.org/10.1080/10412905.2003.9712070
. [all data]
Maia, Taveira, et al., 2003
Maia, J.G.S.; Taveira, F.S.N.; Andrade, E.H.A.; da Silva, M.H.L.; Zoghbi, M.G.B.,
Essential oils of Lippia grandis Schau.,
Flavour Fragr. J., 2003, 18, 5, 417-420, https://doi.org/10.1002/ffj.1241
. [all data]
Masotti, Juteau, et al., 2003
Masotti, V.; Juteau, F.; Bessière, J.M.; Viano, J.,
Seasonal and phenological variations of the essential oil from the narrow endemic species Artemisia molinieri and its biological activities,
J. Agric. Food Chem., 2003, 51, 24, 7115-7121, https://doi.org/10.1021/jf034621y
. [all data]
Mirza and Nik, 2003
Mirza, M.; Nik, Z.B.,
Volatile constituents of Phlomis olivieri Benth. from Iran,
Flavour Fragr. J., 2003, 18, 2, 131-132, https://doi.org/10.1002/ffj.1156
. [all data]
Mirza, Nik, et al., 2003
Mirza, M.; Nik, Z.B.; Dini, M.,
Chemical composition of the essential oils of astrodaucus orientalis (L.) Drude leaves and seeds,
Flavour Fragr. J., 2003, 18, 3, 205-206, https://doi.org/10.1002/ffj.1184
. [all data]
Morteza-Semnani and Saeedi, 2003
Morteza-Semnani, K.; Saeedi, M.,
Constituents of the essential oil of Commiphora myrrha (Nees) Engl. var. molmol,
J. Essent. Oil Res., 2003, 15, 1, 50-51, https://doi.org/10.1080/10412905.2003.9712264
. [all data]
Perez-Alonso, Velasco-Negueruela, et al., 2003
Perez-Alonso, M.J.; Velasco-Negueruela, A.; Palá-Paúl, J.; Sanz, J.,
Variations in the essential oil composition of Artemisia pedemontana gathered in Spain: chemotype camphor-1,8-cineole and chemotype davanone,
Biochem. Syst. Ecol., 2003, 31, 1, 77-84, https://doi.org/10.1016/S0305-1978(02)00082-0
. [all data]
Pitarokili, Tzakou, et al., 2003
Pitarokili, D.; Tzakou, O.; Loukis, A.; Harvala, C.,
Volatile metabolites from Salvia fruticosa as antifungal agents in soilborne pathogens,
J. Agric. Food Chem., 2003, 51, 11, 3294-3301, https://doi.org/10.1021/jf0211534
. [all data]
Priestap, van Baren, et al., 2003
Priestap, H.A.; van Baren, C.M.; Lira, P.D.L.; Coussio, J.D.; Bandoni, A.L.,
Volatile constituents of Aristolochia argentina,
Phytochemistry, 2003, 63, 2, 221-225, https://doi.org/10.1016/S0031-9422(02)00751-3
. [all data]
Rasooli and Mirmostafa, 2003
Rasooli, I.; Mirmostafa, S.A.,
Bacterial susceptibility to and chemical composition of essential oils from Thymus kotschyanus and Thymus persicus,
J. Agric. Food Chem., 2003, 51, 8, 2200-2205, https://doi.org/10.1021/jf0261755
. [all data]
Sajjadi and Mehregan, 2003
Sajjadi, S.E.; Mehregan, I.,
Chemical composition of the essential oil of Prangos Asperula Boiss. subsp. haussknechtii (Boiss.) Hernst. et Heyn fruits, 2003, retrieved from http://www1.tums.ac.ir/daru/daru2%2020003/Dr%20Sajadi.PDF. [all data]
Sajjadi and Mehregan, 2003, 2
Sajjadi, S.E.; Mehregan, I.,
Composition of the essential oil of Stachys Iaxa Boiss. Buhse,
Iran. J. Pharm. Res., 2003, 57-58. [all data]
Stashenko, Jaramillo, et al., 2003
Stashenko, E.E.; Jaramillo, B.E.; Martínez, J.R.,
Comparación de la composición química y de la actividad antioxidante in vitro de los metabolitos secundarios volátiles de plantas de la familia verbenaceae,
Rev. Acad. Colomb. Cienc. Exactas Fis. Nat., 2003, 27, 105, 579-597. [all data]
Velasco-Negueruela, Pérez-Alonso, et al., 2003
Velasco-Negueruela, A.; Pérez-Alonso, M.J.; Pérez de Paz, P.L.; Palá-Paúl, J.; Sanz, J.,
Analysis by gas chromatography-mass spectrometry of the essential oil from the aerial parts of Pimpinella junoniae Ceb. Ort., gathered in La Gomera, Canary Islands, Spain,
J. Chromatogr. A, 2003, 1011, 1-2, 241-244, https://doi.org/10.1016/S0021-9673(03)01082-3
. [all data]
Velickovic, Randjelovic, et al., 2003
Velickovic, D.T.; Randjelovic, N.V.; Ristic, M.S.; Velickovic, A.S.; Smelcerovic, A.A.,
Chemical constituents and antimicrobial activity of the ethanol extracts obtained from the flower, leaf, and stem of Salvia officinalis L.,
J. Serb. Chem. Soc., 2003, 68, 1, 17-24, https://doi.org/10.2298/JSC0301017V
. [all data]
Velickovic, Ristic, et al., 2003
Velickovic, A.S.; Ristic, M.S.; Velickovic, D.T.; Ilic, S.; Mitic, N.D.,
The possibilities of the application of some species of sage (Salvia L.) as auxiliaries in the treatment of some diseases,
J. Serb. Chem. Soc., 2003, 68, 6, 435-445, https://doi.org/10.2298/JSC0306435V
. [all data]
Zoghbi, Andrade, et al., 2003
Zoghbi, M.G.B.; Andrade, E.H.A.; da Silva, M.H.; Carreira, L.M.M.; Maia, J.G.S.,
Essential oils from three Myrcia species,
Flavour Fragr. J., 2003, 18, 5, 421-424, https://doi.org/10.1002/ffj.1242
. [all data]
Azaz. D., Demirci, et al., 2002
Azaz. D.; Demirci, F.; Satil, F.; Kürkcüoglu, M.; Baser, K.H.C.,
Antimicrobial activity of some Satureja essential oils,
Z. Naturforsch. C:, 2002, 57c, 817-821. [all data]
Bos, Koulman, et al., 2002
Bos, R.; Koulman, A.; Woerdenbag, H.J.; Quax, W.J.; Pras, N.,
Volatile components from Anthriscus sylvestris (L.) Hoffm.,
J. Chromatogr. A, 2002, 966, 1-2, 233-238, https://doi.org/10.1016/S0021-9673(02)00704-5
. [all data]
Cicció and Gómez-Laurito, 2002
Cicció, J.F.; Gómez-Laurito, J.,
Volatile constituents of the leaves of Siparuna thecaphora (Siparunaceae) from Turrialba, Costa Rica,
Rev. Biol. Trop., 2002, 50, 3/4, 963-967. [all data]
Das, Ram, et al., 2002
Das, M.; Ram, G.; Singh, A.; Mallavarapu, G.R.; Ramesh, S.; Ram, M.; Kumar, S.,
Volatile constituents of different plant parts of Chamomilla recutita L. Rausch grown in the Indo-Gangetic plains,
Flavour Fragr. J., 2002, 17, 1, 9-12, https://doi.org/10.1002/ffj.1035
. [all data]
Flamini, Ertugrul, et al., 2002
Flamini, G.; Ertugrul, K.; Cioni, P.L.; Morelli, I.; Dural, H.; Bagci, Y.,
Volatile constituents of two endemic Centaurea species from Turkey: C. pseudoscabiosa subsp. pseudoscabiosa and C. hadimensis,
Biochem. Syst. Ecol., 2002, 30, 10, 953-959, https://doi.org/10.1016/S0305-1978(02)00043-1
. [all data]
Gancel, Ollé, et al., 2002
Gancel, A.-L.; Ollé, D.; Ollitrault, P.; Luro, F.; Brillouet, J.-M.,
Leaf and peel volatile compounds of an interspecific citrus somatic hybrid [Citrus aurantifolia (Christm.) Swing. + Citrus paradisi Macfayden],
Flavour Fragr. J., 2002, 17, 6, 416-424, https://doi.org/10.1002/ffj.1119
. [all data]
Gudzic, Djokovic, et al., 2002
Gudzic, B.; Djokovic, D.; Vajs, V.; Palic, R.; Stojanovic, G.,
Composition and antimicrobial activity of the essential oil of Hypericum maculatum Crantz,
Flavour Fragr. J., 2002, 17, 5, 392-394, https://doi.org/10.1002/ffj.1112
. [all data]
Iñigo, Palá-Paúl, et al., 2002
Iñigo, A.; Palá-Paúl, J.; Pérez-Alonso, M.J.; Velasco-Negueruela, A.,
Essential oil composition from the aerial parts of Haplophyllum linifolium (L.) G. Don fil.,
Botanica Complutensis, 2002, 26, 79-83. [all data]
Kobaisy, Tellez, et al., 2002
Kobaisy, M.; Tellez, M.R.; Dayan, F.E.; Duke, S.O.,
Phytotoxicity and volatile constituents from leaves of Callicarpa japonica Thunb.,
Phytochemistry, 2002, 61, 1, 37-40, https://doi.org/10.1016/S0031-9422(02)00207-8
. [all data]
Krauze-Baranowska, Mardarowicz, et al., 2002
Krauze-Baranowska, M.; Mardarowicz, M.; Wiwart, M.; Poblocka, L.; Dynowska, M.,
Antifungal activity of the essential oils from some species of the genus Pinus,
Z. Naturforsch., 2002, 57c, 478-482. [all data]
Kuiate, Bessière, et al., 2002
Kuiate, J.-R.; Bessière, J.-M.; Zollo, P.-H.A.,
Composition of the essential oils from three Laggera Spp. from Cameroon,
Flavour Fragr. J., 2002, 17, 2, 105-108, https://doi.org/10.1002/ffj.1057
. [all data]
Limberger, Simões-Pires, et al., 2002
Limberger, R.P.; Simões-Pires, C.; Sobral, M.; Menu, C.; Bessiere, J.-M.; Henriques, A.T.,
Essential oils from some Myrceugenia species (Myrtaceae),
Flavour Fragr. J., 2002, 17, 5, 341-344, https://doi.org/10.1002/ffj.1113
. [all data]
Maia, Zoghbi, et al., 2002
Maia, J.G.S.; Zoghbi, M.G.B.; Andrade, E.H.A.; da Silva, M.H.L.; Luz, A.I.R.; da Silva, J.D.,
Essential oils composition of Eupatorium species growing wild in the Amazon,
Biochem. Syst. Ecol., 2002, 30, 11, 1071-1077, https://doi.org/10.1016/S0305-1978(02)00059-5
. [all data]
Norouzi-Arasi, Yavari, et al., 2002
Norouzi-Arasi, H.; Yavari, I.; Ghaffarzadeh, F.; Mortazavi, M.-S.,
Volatile constituents of Cymbopogon olivieri (Boiss.) Bor from Iran,
Flavour Fragr. J., 2002, 17, 4, 272-274, https://doi.org/10.1002/ffj.1096
. [all data]
Priestap, van Baren, et al., 2002
Priestap, H.A.; van Baren, C.M.; Lira, P.D.L.; Prado, H.J.; Neugebauer, M.; Mayer, R.; Bandoni, A.L.,
Essential oils from aerial parts of Aristolochia gibertii Hook.,
Flavour Fragr. J., 2002, 17, 1, 69-71, https://doi.org/10.1002/ffj.1044
. [all data]
Schwob, Bessière, et al., 2002
Schwob, I.; Bessière, J.-M.; Viano, J.,
Composition of the essential oils of Hypericum perforatum L. from southeastern France,
C.R. Acad. Sci. Ser. 3:, 2002, 325, 781-785. [all data]
Sefidkon, Dabiri, et al., 2002
Sefidkon, F.; Dabiri, M.; Alamshahi, A.,
Analysis of the essential oil of Nepeta fissa C.A. Mey from Iran,
Flavour Fragr. J., 2002, 17, 2, 89-90, https://doi.org/10.1002/ffj.1045
. [all data]
Sefidkon, 2002
Sefidkon, F.,
Essential oil of Lantana camara L. occurring in Iran,
Flavour Fragr. J., 2002, 17, 1, 78-80, https://doi.org/10.1002/ffj.1048
. [all data]
Velasco-Negueruela, Pérez-Alonso, et al., 2002
Velasco-Negueruela, A.; Pérez-Alonso, M.J.; Palá-Paúl, J.; Íñigo, A.; López, G.,
Leaf essential oils analysis of Juniperus navicularis Gandoger,
Botanica Complutensis, 2002, 26, 85-91. [all data]
Velickovic, Randjelovic, et al., 2002
Velickovic, D.T.; Randjelovic, N.V.; Ristic, M.S.; Smelcerovic, A.A.; Velickovic, A.S.,
Chemical composition and antimicrobial action of the ethanol extracts of Salvia pratensis L., Salvia glutinosa L. and Salvia aethiopis L.,
J. Serb. Chem. Soc., 2002, 67, 10, 639-646, https://doi.org/10.2298/JSC0210639V
. [all data]
Zoghbi, Andrade, et al., 2002
Zoghbi, M.G.B.; Andrade, E.H.A.; da Silva, M.H.L.; Maia, J.G.S.,
Volatile constituents of Lippia lupulina Cham.,
Flavour Fragr. J., 2002, 17, 1, 29-31, https://doi.org/10.1002/ffj.1032
. [all data]
Cornu, Carnat, et al., 2001
Cornu, A.; Carnat, A.-P.; Martin, B.; Coulon, J.-B.; Lamaison, J.-L.; Berdagué, J.-L.,
Solid-phase microextraction of volatile components from natural grassland plants,
J. Agric. Food Chem., 2001, 49, 1, 203-209, https://doi.org/10.1021/jf0008341
. [all data]
Dabiri and Sefidkon, 2001
Dabiri, M.; Sefidkon, F.,
Analysis of the essential oil from aerial parts of Perovskia atriplicifolia Benth. at different stages of plant growth,
Flavour Fragr. J., 2001, 16, 6, 435-438, https://doi.org/10.1002/ffj.988
. [all data]
Flamini, Cioni, et al., 2001
Flamini, G.; Cioni, P.L.; Morelli, I.; Maccioni, S.; Monti, G.,
Composition of the essential oil of Teucrium fruticans L. from the Maremma Regional Park (Tuscany, Italy),
Flavour Fragr. J., 2001, 16, 5, 367-369, https://doi.org/10.1002/ffj.1014
. [all data]
Gallori, Flamini, et al., 2001
Gallori, S.; Flamini, G.; Bilia, A.R.; Morelli, I.; Landini, A.; Vincieri, F.F.,
Chemical composition of some traditional herbal drug preparations: essential oil and aromatic water of costmary (Balsamita suaveolens Pers.),
J. Agric. Food Chem., 2001, 49, 12, 5907-5910, https://doi.org/10.1021/jf0107656
. [all data]
Gupta, Mallavarapu, et al., 2001
Gupta, R.; Mallavarapu, G.R.; Banerjee, S.; Kumar, S.,
Characteristics of an isomenthone-rich somaclonal mutant isolated in a geraniol-rich rose-scented geranium accession of Pelargonium graveolens,
Flavour Fragr. J., 2001, 16, 5, 319-324, https://doi.org/10.1002/ffj.1002
. [all data]
Jacquemond-Collet, Bessière, et al., 2001
Jacquemond-Collet, I.; Bessière, J.-M.; Hannedouche, S.; Bertrand, C.; Fourasté, I.; Moulis, C.,
Identification of the alkaloids of Galipea officinalis by gas chromatography-mass spectrometry,
Phytochem. Anal., 2001, 12, 5, 312-319, https://doi.org/10.1002/pca.594
. [all data]
Kalemba, Marschall, et al., 2001
Kalemba, D.; Marschall, H.; Bradesi, P.,
Constituents of the essential oil of Solidago gigantea Ait. (giant goldenrod),
Flavour Fragr. J., 2001, 16, 1, 19-26, https://doi.org/10.1002/1099-1026(200101/02)16:1<19::AID-FFJ940>3.0.CO;2-U
. [all data]
Marongiu, Porcedda, et al., 2001
Marongiu, B.; Porcedda, S.; Porta, G.D.; Reverchon, E.,
Extraction and isolation of Salvia desoleana and Mentha spicata subsp. insularis essential oils by supercritical CO2,
Flavour Fragr. J., 2001, 16, 5, 384-388, https://doi.org/10.1002/ffj.1021
. [all data]
Mirza, Ahmadi, et al., 2001
Mirza, M.; Ahmadi, L.; Tayebi, M.,
Volatile constituents of Hymenocrater incanus Bunge, an Iranian endemic species,
Flavour Fragr. J., 2001, 16, 4, 239-240, https://doi.org/10.1002/ffj.983
. [all data]
Palá-Paúl, Pérez-Alonso, et al., 2001
Palá-Paúl, J.; Pérez-Alonso, M.J.; Velasco-Negueruela, A.; Palá-Paúl, R.; Sanz, J.; Conejero, Fco.,
Seasonal variation in chemical constituents of Santolina rosmarinifolia L. ssp. rosmarinifolia,
Biochem. Syst. Ecol., 2001, 29, 7, 663-672, https://doi.org/10.1016/S0305-1978(01)00032-1
. [all data]
Santos-Gomes and Fernandes-Ferreira, 2001
Santos-Gomes, P.C.; Fernandes-Ferreira, M.,
Organ- and season-dependent variation in the essential oil composition of Salvia officinalis L. cultivated at two different sites,
J. Agric. Food Chem., 2001, 49, 6, 2908-2916, https://doi.org/10.1021/jf001102b
. [all data]
Tellez M., Estell R., et al., 2001
Tellez M.; Estell R.; Fredrickson E.; Powell J.; Wedge D.; Schrader K.; Kobaisy M.,
Extracts of Flourensia cernua (L): Volatile constituents and antifungal, antialgal, and antitermite bioactivities,
J. Chem. Ecol., 2001, 27, 11, 2263-2273, https://doi.org/10.1023/A:1012283005014
. [all data]
Baser, Özek, et al., 2000
Baser, K.H.C.; Özek, T.; Demirci, B.; Kürkcüoglu, M.; Aytac, Z.; Duman, H.,
Composition of the essential oils of Zosima absinthifolia (Vent.) Link and Ferula elaeochytris Korovin from Turkey,
Flavour Fragr. J., 2000, 15, 6, 371-372, https://doi.org/10.1002/1099-1026(200011/12)15:6<371::AID-FFJ919>3.0.CO;2-Z
. [all data]
Meccia, Rojas, et al., 2000
Meccia, G.; Rojas, L.B.; Rosquete, C.; Feliciano, A.S.,
Essential oil of Croton ovalifolius Vahl from Venezuela,
Flavour Fragr. J., 2000, 15, 3, 144-146, https://doi.org/10.1002/1099-1026(200005/06)15:3<144::AID-FFJ882>3.0.CO;2-C
. [all data]
Tellez, Dayan, et al., 2000
Tellez, M.R.; Dayan, F.E.; Schrader, K.K.; Wedge, D.E.; Duke, S.O.,
Composition and some biological activities of the essential oils of Callicarpa Americana (L.),
J. Agric. Food Chem., 2000, 48, 7, 3008-3012, https://doi.org/10.1021/jf991026g
. [all data]
Kalemba, 1999
Kalemba, D.,
Constituents of the essential oil of Artemisia asiatica Nakai,
Flavour Fragr. J., 1999, 14, 3, 173-176, https://doi.org/10.1002/(SICI)1099-1026(199905/06)14:3<173::AID-FFJ805>3.0.CO;2-Q
. [all data]
Khalilov L.M., Khalilova A.Z., et al., 1999
Khalilov L.M.; Khalilova A.Z.; Odinokov V.N.; Baltaev U.A.; Paramonov E.A.; Dzhemilev U.M.,
Identification and biological activity of the volatile organic substances emitted by plants and insects - II. Sesquiterpene composition of the native scent of leaves of the potato Solanum tuberosum,
Chem. Nat. Compd. (Engl. Transl.), 1999, 35, 4, 422-426, https://doi.org/10.1007/BF02282508
. [all data]
Koulman, 1999
Koulman, A.,
Podophyllotoxin: a study of biosynthesis, evolution, function, and use of podophyllotoxin and related lignans, University Library Groningen, Nederlands, 1999, 188, retrieved from http://www.ub.rug.nl/eldoc/dis/science/a.koulman/. [all data]
Menon, Chacko, et al., 1999
Menon, A.N.; Chacko, S.; Narayanan, C.S.,
Free and glycosidically bound volatiles of cardamom (Eletteria cardamomum Maton var. miniscula Burkill),
Flavour Fragr. J., 1999, 14, 1, 65-68, https://doi.org/10.1002/(SICI)1099-1026(199901/02)14:1<65::AID-FFJ789>3.0.CO;2-A
. [all data]
Oberhofer, Nikiforov, et al., 1999
Oberhofer, B.; Nikiforov, A.; Buchbauer, G.; Jirovetz, L.; Bicchi, C.,
Investigation of the alteration of the composition of various essential oils used in aroma lamp applications,
Flavour Fragr. J., 1999, 14, 5, 293-299, https://doi.org/10.1002/(SICI)1099-1026(199909/10)14:5<293::AID-FFJ829>3.0.CO;2-T
. [all data]
Prikhod'ko, Klyuev, et al., 1999
Prikhod'ko, A.B.; Klyuev, N.A.; Volkovich, S.V.; Emets, T.I.; Petrenko, V.V.; Dolya, E.V.,
Component composition od the essential oil of Thymus dimorphus,
Chem. Nat. Comp., 1999, 35, 1, 46-51, https://doi.org/10.1007/BF02238208
. [all data]
Sefidkon, Dabiri, et al., 1999
Sefidkon, F.; Dabiri, M.; Rahimi-Bidgoly, A.,
The effect of distillation methods and stage of plant growth on the essential oil content and composition of Thymus kotschyanus Boiss. Hohen,
Flavour Fragr. J., 1999, 14, 6, 405-408, https://doi.org/10.1002/(SICI)1099-1026(199911/12)14:6<405::AID-FFJ853>3.0.CO;2-M
. [all data]
Sefidkon and Khajavi, 1999
Sefidkon, F.; Khajavi, M.S.,
Chemical composition of the essential oils of two Salvia species from Iran: Salvia verticillata L. and Salvia santolinifolia Boiss.,
Flavour Fragr. J., 1999, 14, 2, 77-78, https://doi.org/10.1002/(SICI)1099-1026(199903/04)14:2<77::AID-FFJ726>3.0.CO;2-9
. [all data]
Sefidkon and Mirza, 1999
Sefidkon, F.; Mirza, M.,
Chemical composition of the essential oils of two Salvia species from Iran, Salvia virgata Jacq. and Salvia syriaca L.,
Flavour Fragr. J., 1999, 14, 1, 45-46, https://doi.org/10.1002/(SICI)1099-1026(199901/02)14:1<45::AID-FFJ774>3.0.CO;2-S
. [all data]
Viallon C., Verdier-Metz I., et al., 1999
Viallon C.; Verdier-Metz I.; Denoyer C.; Pradel P.; Coulon J.B.; Berdague J.L.,
Desorbed terpenes and sesquiterpenes from forages and cheeses,
J. Dairy Res., 1999, 66, 2, 319-326, https://doi.org/10.1017/S0022029999003520
. [all data]
Zollo, Biyiti, et al., 1998
Zollo, P.H.A.; Biyiti, L.; Tchoumbougnang, F.; Menut, C.; Lamaty, G.; Bouchet, Ph.,
Aromatic plants of tropical central Africa. Part XXXII. Chemical composition and antifungal activity of thirteen essential oils from aromatic plants of Cameroon,
Flavour Fragr. J., 1998, 13, 2, 107-114, https://doi.org/10.1002/(SICI)1099-1026(199803/04)13:2<107::AID-FFJ701>3.0.CO;2-G
. [all data]
Elias, Simoneit, et al., 1997
Elias, V.O.; Simoneit, B.R.T.; Cardoso, J.N.,
Analysis of volatile sesquiterpenoids in environmental and geological samples,
J. Hi. Res. Chromatogr., 1997, 20, 6, 305-309, https://doi.org/10.1002/jhrc.1240200602
. [all data]
Kökdil, Kurucu, et al., 1997
Kökdil, G.; Kurucu, S.; Topcu, G.,
Chemical constituents of the essential oils of Nepeta italica L. and Nepeta sulfuriflora P. H. Davis,
Flavour Fragr. J., 1997, 12, 1, 33-35, https://doi.org/10.1002/(SICI)1099-1026(199701)12:1<33::AID-FFJ609>3.0.CO;2-V
. [all data]
Kökdil, Tanker, et al., 1997
Kökdil, G.; Tanker, M.; Kurucu, S.; Topcu, G.,
Essential oil analysis of Nepeta cilicia Boiss.,
Flavour Fragr. J., 1997, 12, 2, 99-101, https://doi.org/10.1002/(SICI)1099-1026(199703)12:2<99::AID-FFJ619>3.0.CO;2-#
. [all data]
Salgueiro, Vila, et al., 1997
Salgueiro, L.R.; Vila, R.; Tomi, F.; Figueiredo, A.C.; Barroso, J.G.; Cañigueral, S.; Casanova, J.; da Cunha, A.P.; Adzet, T.,
Variability of essential oils of Thymus caespititius from Portugal,
Phytochemistry, 1997, 45, 2, 307-311, https://doi.org/10.1016/S0031-9422(96)00872-2
. [all data]
Tellez, Estell, et al., 1997
Tellez, M.R.; Estell, R.E.; Frederickson, E.L.; Havstad, K.M.,
Essntial oil of Flourensia cernua DC,
J. Essent. Oil Res., 1997, 9, 6, 619-624, https://doi.org/10.1080/10412905.1997.9700799
. [all data]
Zygadlo, Ariza-Espinar, et al., 1997
Zygadlo, J.A.; Ariza-Espinar, L.; Velasco-Negueruela, A.; Perez-Alonso, M.J.,
Volatile constituents of Stevia achalensis hieronymus,
Flavour Fragr. J., 1997, 12, 4, 297-299, https://doi.org/10.1002/(SICI)1099-1026(199707)12:4<297::AID-FFJ625>3.0.CO;2-2
. [all data]
Gawdzik, Mardarowicz, et al., 1996
Gawdzik, J.; Mardarowicz, M.; Suprynowicz, Z.; Kawka, S.; Wolski, T.,
Supercritical fluid extraction of essential oils from the fruits of Archangelica off. Hoffm. and their characterization by GC/MS,
J. Hi. Res. Chromatogr., 1996, 19, 4, 237-240, https://doi.org/10.1002/jhrc.1240190416
. [all data]
Orav, Kailas, et al., 1996
Orav, A.; Kailas, T.; Liiv, M.,
Analysis of terpenoic composition of conifer needle oils by steam distillation/extraction, gas chromatography and gas chromatography-mass spectrometry,
Chromatographia, 1996, 43, 3/4, 215-219, https://doi.org/10.1007/BF02292955
. [all data]
Rajeswara, Kaul, et al., 1996
Rajeswara, B.R.; Kaul, P.N.; Bhattacharya, A.K.; Mallavarapu, G.R.; Ramesh, S.,
Yield and chemical composition of the essential oils of three Cymbopogon species suffering from iron chlorosis,
Flavour Fragr. J., 1996, 11, 5, 289-293, https://doi.org/10.1002/(SICI)1099-1026(199609)11:5<289::AID-FFJ590>3.0.CO;2-7
. [all data]
Sagrero-Nieves and Bartley, 1996
Sagrero-Nieves, L.; Bartley, J.P.,
Volatile components from the leaves of heterotheca inuloides Cass.,
Flavour Fragr. J., 1996, 11, 1, 49-51, https://doi.org/10.1002/(SICI)1099-1026(199601)11:1<49::AID-FFJ538>3.0.CO;2-J
. [all data]
Thanh, Dung, et al., 1996
Thanh, L.; Dung, N.X.; Bighetti, A.; Casanova, J.; Leclercq, P.A.,
Combination of cCapillary GC, GC/MS and 13C-NMR for the Characterization of the Rhizome Oil of Piper betle L. (Piperaceae) from Vietnam,
Spectroscopy, 1996, 13, 2, 131-136, https://doi.org/10.1155/1997/397354
. [all data]
Demarne and van der Walt, 1993
Demarne, F.-E.; van der Walt, J.J.A.,
Composition of the Essential Oil of Pelargonium citronellum (Geraniaceae),
J. Essent. Oil Res., 1993, 5, 3, 233-238, https://doi.org/10.1080/10412905.1993.9698214
. [all data]
Mallavarapu, Ramesh, et al., 1993
Mallavarapu, G.R.; Ramesh, S.; Kaul, P.N.; Battacharya, A.K.; Rao, B.R.R.,
The essential oil of Hyptis suaveolens (L.) Poit.,
J. Essent. Oil Res., 1993, 5, 3, 321-323, https://doi.org/10.1080/10412905.1993.9698230
. [all data]
Binder, Turner, et al., 1990
Binder, R.G.; Turner, C.E.; Flath, R.A.,
Volatile components of purple starthistle,
J. Agric. Food Chem., 1990, 38, 4, 1053-1055, https://doi.org/10.1021/jf00094a030
. [all data]
Binder, Turner, et al., 1990, 2
Binder, R.G.; Turner, C.E.; Flath, R.A.,
Comparison of yellow starthistle volatiles from different plant parts,
J. Agric. Food Chem., 1990, 38, 3, 764-767, https://doi.org/10.1021/jf00093a038
. [all data]
Binder and Flath, 1989
Binder, R.G.; Flath, R.A.,
Volatile components of pineapple guava,
J. Agric. Food Chem., 1989, 37, 3, 734-736, https://doi.org/10.1021/jf00087a034
. [all data]
de Pooter, Nicolai, et al., 1988
de Pooter, H.L.; Nicolai, B.; De Laet, J.; De Buyck, L.F.; Schamp, N.M.; Goetghebeur, P.,
The Essential Oils of Five Nepeta Species. A Preliminary Evaluation of their Use in Chemotaxonomy by Cluster Analysis,
Flavour Fragr. J., 1988, 3, 4, 155-159, https://doi.org/10.1002/ffj.2730030404
. [all data]
Ramaswami, Briscese, et al., 1988
Ramaswami, S.K.; Briscese, P.; Gargiullo, R.J.; von Geldern, T.,
Sesquiterpene hydrocarbons: from mass confusion to orderly line-up
in Flavors and Fragrances: A World Perspective. Proceedings of the 10th International Congress of Essential Oils, Fragrances and Flavors, Lawrence,B.M.; Mookherjee,B.D.; Willis,B.J., ed(s)., Elsevier, New York, 1988, 951-980. [all data]
Nykanen, 1986
Nykanen, I.,
High Resolution Gas Chromatographic - Mass Spectrometric determination of the Flavour Composition of Wild Majoram (Origanum vulgare L.) Cultivated in Finland,
Z. Lebensm Unters Forsch, 1986, 183, 4, 267-272, https://doi.org/10.1007/BF01087742
. [all data]
De Pooter and Schamp, 1986
De Pooter, H.L.; Schamp, N.M.,
Comparison of the Volatile Composition of Some Calamintha/Satureja Species,
Prog. Essnt. Oil. Res., 1986, 139-150. [all data]
Ramaswami, Briscese, et al., 1986
Ramaswami, S.K.; Briscese, P.; Gargiullo, R.J.; von Geldern, T.,
Sesquiterpene hydrocarbons: from mass confusion to orderly line-up
in Flavors and Fragrances: A World Perspective, Lawrence,B.M.; Mookherjee,B.D.; Willis,B.J., ed(s)., Proceedings of the 10th International Congress of Essential Oils, Fragrances, and Flavors, Washington, DC, 1986, 951-959. [all data]
Shibamoto and Jennings, 1977
Shibamoto, T.; Jennings, W.G.,
The volatile composition of the leaf oil of California Juniper (J. californica Carr.)
in Proceedings of VII International Congress of Essential Oils, October 7-11, 1977, Kyoto, Japan, 1977, 413-418. [all data]
Albano, Lima, et al., 2012
Albano, S.M.; Lima, A.S.; Miguel, M.G.; Pedro, L.G.; Barroso, J.G.; Figueiredo, A.C.,
Antioxidant, anti-5-lipoxygenase and antiacetylcholinesterase activities of essential oils and decoction water of some aromatic plants,
Rec. Nat. Prod., 2012, 6, 1, 35-48. [all data]
da Silva, de Souza, et al., 2012
da Silva, A.C.; de Souza, P.E.; Machado, J. daC.; da Silva, B.M.; Pinto, J.E.B.P.,
Effectiveness of essential oils in the treatment of Colletotrichum truncatum-infected soybean seeds,
Tropical Plant Patology, 2012, 37, 5, 305-313, https://doi.org/10.1590/S1982-56762012000500001
. [all data]
Chaverri, Diaz, et al., 2011
Chaverri, C.; Diaz, C.; Cicco, J.F.,
Chemical analysis of essential oils from Ocotea gomezii W.C. Burger and Ocotea morae Gomez-Laur. (Lauraceae) collected at Reserva biologica Alberto M. Brenes in Costa Rica and their cytotoxic activity on Tumor cell lines,
J. Braz. Chem. Soc., 2011, 22, 4, s1-s4, https://doi.org/10.1590/S0103-50532011000400018
. [all data]
Karimi, Farmany, et al., 2011
Karimi, H.; Farmany, A.; Noorizadeh, H.,
Prediction of linear retention index of Teucrium chamaedrys volatiles in GCxGC-TOF/MS by linear model,
World Appl. Sci. J., 2011, 15, 8, 1086-1088. [all data]
Bagci, Yazgin, et al., 2010
Bagci, E.; Yazgin, A.; Hayta, S.; Cakilcioglu, U.,
Composition of the essential oil of Teucrium chamaedrys L. (Lamiaceae) from Turkey,
J. Med. Plants Res., 2010, 4, 23, 2588-2590. [all data]
Liu, Chu, et al., 2010
Liu, Z.L.; Chu, S.S.; Liu, Q.R.,
Chemical composition and insecticidial activity against Sitophilus zeamais of the essential oils of Artemisia capillaris and Artemisia mongolica,
Molecules, 2010, 15, 4, 2600-2608, https://doi.org/10.3390/molecules15042600
. [all data]
Courtois, Paine, et al., 2009
Courtois, E.A.; Paine, C.E.; Blandinieres, P.-A.; Stien, D.; Bessiere, J.-M.; Houel, E.; Baraloto, C.; Chave, J.,
Diversity of the volatile organic compounds emitted by 55 species of tropical trees: a survey in French Guiana,
J. Chem. Ecol., 2009, 35, 11, 1349-1362, https://doi.org/10.1007/s10886-009-9718-1
. [all data]
Maggi, Bilek, et al., 2009
Maggi, F.; Bilek, T.; Lucarini, D.; Papa, F.; Sagratini, G.; Vittori, S.,
Melittis melissophyllum L. subsp. melissophylum (Lamiaceae) from central Italy: A new source of a mushrrom-like flavour,
Food Chem., 2009, 113, 1, 216-221, https://doi.org/10.1016/j.foodchem.2008.07.066
. [all data]
Mancini, Arnold, et al., 2009
Mancini, E.; Arnold, N.A.; De Martino, L.; De Feo, V.; Formisano, C.; Rigano, D.; Senatore, F.,
Chemical composition and phytotoxic effects of essential oils of Salvia hierosolymitana Boiss. and Salvia multicaulis Vahl. var. simplicifolia Boiss. growing wild in Lebanon,
Molecules, 2009, 14, 11, 4725-4736, https://doi.org/10.3390/molecules14114725
. [all data]
Mendes, Trindade, et al., 2009
Mendes, M.D.; Trindade, H.; Figueiredo, A.C.; Barroso, J.G.; Fontinha, S.S.; Pedro, L.G.,
Volatile and molecular characterization of two Portuguese endemic species: Angelica lignescens and Melanoselinium decipiens,
Biochen. Systematics Ecol., 2009, 37, 2, 98-105, https://doi.org/10.1016/j.bse.2008.12.006
. [all data]
Kupcinskiene, Stikliene, et al., 2008
Kupcinskiene, E.; Stikliene, A.; Judzentiene, A.,
The essential oil guatitative composition in the needles of Pinus sylvestris L. growing along industrial transects,
Environ. Pollution, 2008, 155, 3, 481-491, https://doi.org/10.1016/j.envpol.2008.02.001
. [all data]
Nogueira, Marcelo-Curto, et al., 2008
Nogueira, T.; Marcelo-Curto, M.J.; Cristina Figueiredo, A.; Barroso, J.G.; Pedro, L.G.; Rubiolo, P.; Bicchi, C.,
Chemotaxonomy of Hypericum genus from Portugal: Geographical distribution and essential oils composition of Hypericum perfoliatum, Hypericum humifusum, Hypericum linarifolium and Hypericum pulchrum,
Biochem. Syst. Ecol., 2008, 36, 1, 40-50, https://doi.org/10.1016/j.bse.2007.07.004
. [all data]
Agabriel, Cornu, et al., 2007
Agabriel, C.; Cornu, A.; Journal, C.; Sibra, C.; Groller, C.; MArtin, B.,
Tanker milk variability according to farm feeding practices: vitamins A and E, carotenoids, color, and terpenoids,
J. Dairy Sci., 2007, 90, 10, 4884-4896, https://doi.org/10.3168/jds.2007-0171
. [all data]
Albuquerque, Lemos, et al., 2007
Albuquerque, M.R.J.R.; Lemos, T.L.G.; Pessoa, O.D.L.; Nunes, E.P.; Nascimento, R.F.; Silveira, E.R.,
Chemical composition of the essential oil from Vernonia scorpioides (Asteraceae),
Flavour Fragr. J., 2007, 22, 4, 249-250, https://doi.org/10.1002/ffj.1782
. [all data]
Albuquerque, Vasconcelos Silva, et al., 2007
Albuquerque, R.L.; Vasconcelos Silva, M.G.; Machado, M.I.L.; Matos, F.J.A.; Morais, S.M.; Neto, J.S.,
Chemical composition and antioxidant activity of Plectranthus grandis and P. ornatus essential oils from north-eastern Brazil,
Flavour Fragr. J., 2007, 22, 1, 24-26, https://doi.org/10.1002/ffj.1730
. [all data]
Cole, Haber, et al., 2007
Cole, R.A.; Haber, W.A.; Setzer, W.N.,
Chemical composition of essential oils of seven species of Eugenia from Monteverde, Costa Rica,
Biochem. Syst. Ecol., 2007, 35, 12, 877-886, https://doi.org/10.1016/j.bse.2007.06.013
. [all data]
Formisano, Mignola, et al., 2007
Formisano, C.; Mignola, E.; Rigano, D.; Senatore, F.; Bellone, G.; Bruno, M.; Rosselli, S.,
Chemical composition and antimicrobial activity of the essential oil from aerial parts of Micromeria fruticulosa (Bertol.) Grande (Lamiaceae) growing wild in Southern Italy,
Flavour Fragr. J., 2007, 22, 4, 289-292, https://doi.org/10.1002/ffj.1795
. [all data]
Formisano, Rigano, et al., 2007
Formisano, C.; Rigano, D.; Napolitano, F.; Senatore, F.; Arnold, N.A.; Piozzi, F.; Rosselli, S.,
Volatile constituents of Calamintha ariganifolia Boiss. growing wild in Lebanon,
Natural Product Communications, 2007, 2, 12, 1253-1256. [all data]
Haznagy-Radnai, Szigle, et al., 2007
Haznagy-Radnai, E.; Szigle, Sz.; Mathe, I.,
Analysis of the essential oil of Downy wounderwort (Stachys Germanica L.),
Acta Fac. Pharm. Univer. Comenianae, 2007, 54, 78-83. [all data]
Liolios, Laouer, et al., 2007
Liolios, C.; Laouer, H.; Boulaacheb, N.; Gortzi, O.; Chinou, I.,
Chemical Composition and Antimicrobial Activity of the Essential Oil of Algherian Phlomis bovei De Noe subsp. bovei,
Molecules, 2007, 12, 4, 772-781, https://doi.org/10.3390/12040772
. [all data]
Meekijjaroenroj, Bessière, et al., 2007
Meekijjaroenroj, A.; Bessière, J.-M.; Anstett, M.-C.,
Chemistry of floral scents in four Licuala species (Arecaceae),
Flavour Fragr. J., 2007, 22, 4, 300-310, https://doi.org/10.1002/ffj.1797
. [all data]
Mockute, Bernotiene, et al., 2007
Mockute, D.; Bernotiene, G.; Judzentiene, A.,
The essential oil of Ground Ivy (Glechoma hederaceae L.) growing wild in Eastern Lithuania,
J. Essent. Oil Res., 2007, 19, 5, 449-451, https://doi.org/10.1080/10412905.2007.9699948
. [all data]
Moriarity, Bansal, et al., 2007
Moriarity, D.M.; Bansal, A.; Cole, R.A.; Takaku, S.; Haber, W.A.; Setzer, W.N.,
Selective cytotoxic activities of leaf essential oils from Monteverde Costa Rica,
Natural Product Communications, 2007, 2, 12, 1263-1268. [all data]
Moronkola, Ogunwande, et al., 2007
Moronkola, D.O.; Ogunwande, I.A.; Walker, T.M.; Setzer, W.N.; Oyewole, I.O.,
Identification of the main volatile compounds in the leaf and flower of Tithonia diversifolia (Hemsl) Gray,
J. Nat. Med., 2007, 61, 1, 63-66, https://doi.org/10.1007/s11418-006-0019-5
. [all data]
Nivinsliene, Butkiene, et al., 2007
Nivinsliene, O.; Butkiene, R.; Gudalevic, A.; Mockute, D.; Meskauskiene, V.; Grigaliunaite, B.,
Influence of urban environment on chemical composition of Tilia cordata essential oil,
Chemija, 2007, 18, 1, 44-49. [all data]
Parker, Pollnitz, et al., 2007
Parker, M.; Pollnitz, A.P.; Cozzolino, D.; Leigh Francis, I.; Herderich, M.J.,
Identification and Quantification of a Marker Compound for 'Pepper' Aroma and Flavor in Shiraz Grape Berries by Combination of Chemometrics and Gas Chromatography-Mass Spectrometry,
J. Agric. Food Chem., 2007, 55, 15, 5948-5955, https://doi.org/10.1021/jf0705320
. [all data]
Pontes, de Olivera, et al., 2007
Pontes, W.J.T.; de Olivera, J.C.G.; da Camara, C.A.G.; Lopes, A.C.H.R.; Gondim Jr.; de Olivera, J.V.; Barros, R.; Schwartz, M.O.E.,
Chemical composition and acaridical activity of the leaf and fruit essential oils of Protium heptaphyllum (Aubl.) Marchand (Burseraceae),
Acta Amazonica, 2007, 37, 1, 103-110, https://doi.org/10.1590/S0044-59672007000100012
. [all data]
Rodrigues, Antunes, et al., 2007
Rodrigues, F.S.L.M.; Antunes, L.C.S.; Figueiredo, A.C.; Costa, M.M.; Pereira, J.D.S.; Colaço, R.D.R.; Miranda, H.H.S.; Barroso, J.G.; Pedro, L.G.; Scheffer, J.J.C.,
Composition of the leaf, flower and fruit volatile oils of Pittosporum tobira (Thunb.) W. T. Aiton grown in three locations in Portugal,
Flavour Fragr. J., 2007, 22, 4, 311-316, https://doi.org/10.1002/ffj.1798
. [all data]
Serrano, Cornu, et al., 2007
Serrano, E.; Cornu, A.; Kondjoyan, N.; Figueredo, G.; Agabriel, J.; Micol, D.,
Terpene accumulation in muscle and fatty tissues of calves supplement with essential oils,
J. Animal Feed Sci., 2007, 16, 168-179. [all data]
Setzer, Stokes, et al., 2007
Setzer, W.N.; Stokes, S.L.; Penton, A.F.; Takaku, S.; Haber, W.A.; Hansell, E.; Caffrey, C.R.; McKerrow, J.H.,
Cruzain inhibitory activity of leaf essential oils of neotropical Lauraceae and essential oil components,
Natural Product Communications, 2007, 2, 12, 1203-1210. [all data]
Stokes, Cole, et al., 2007
Stokes, S.L.; Cole, R.A.; Rangelova, M.P.; Haber, W.A.; Setzer, W.N.,
Cruzain inhibitory activity of the leaf essential oil from an undescribed species of Eugenia from Monteverde, Costa Rica,
Natural Product Communications, 2007, 2, 12, 1211-1213. [all data]
Takaku, Haber, et al., 2007
Takaku, S.; Haber, W.A.; Setzer, W.N.,
Leaf essential oil composition of 10 species of Ocotea (Lauraceae) from Monteverde, Costa Rica,
Biochem. Syst. Ecol., 2007, 35, 8, 525-532, https://doi.org/10.1016/j.bse.2007.02.003
. [all data]
Formisano C., Senatore F., et al., 2006
Formisano C.; Senatore F.; Bruno M.; Bellone G.,
Chemical composition and antimicrobial activity of the essential oil of Phlomis ferruginea Ten. (Lamiaceae) growing wild in Southern Italy,
Flavour Fragr. J., 2006, 21, 5, 848-851, https://doi.org/10.1002/ffj.1740
. [all data]
Güllüce, Özer, et al., 2006
Güllüce, M.; Özer, H.; Baris, Ö.; Daferera, D.; Sahin, F.; Polissiou, M.,
Chemical Composition of the Essential Oil of Salvia aethiopis L.,
Turkish Journal of Biology, 2006, 30, 231-233. [all data]
Judzentiene and Buzelyte, 2006
Judzentiene, A.; Buzelyte, J.,
Chemical composition of essential oils of Artemisia vulgaris L. (mugwort) from North Lithuania,
Chemija, 2006, 17, 1, 12-15. [all data]
Mockute, Bernotiene, et al., 2006
Mockute, D.; Bernotiene, G.; Judzentiene, A.,
Germacrene D chemotype of essential oils of Leonurus cardiaca L. growing wild in Vilnus district (Lithuania),
J. Essent. Oil Res., 2006, 18, 5, 566-568, https://doi.org/10.1080/10412905.2006.9699169
. [all data]
Santos, Nunes, et al., 2006
Santos, R.P.; Nunes, E.P.; Nascimento, R.F.; Santiago, G.M.P.; Menezes, G.H.A.; Silveira, E.R.; Pessoa, O.D.L.,
Chemical Composition and Larvicidal Activity of the Essential Oils of Cordia leucomalloides and Cordia curassavica from the Northeast of Brazil,
J. Braz. Chem. Soc., 2006, 17, 5, 1027-1030, https://doi.org/10.1590/S0103-50532006000500030
. [all data]
Schmidt, Noletto, et al., 2006
Schmidt, J.M.; Noletto, J.A.; Vogler, B.; Setzer, W.N.,
Abaco Bush Medicine: Chemical composition of the essential oils of four aromatic medicinal plants from Abaco Island, Bahamas,
J. Herbs, Spices Medicinal Plants, 2006, 12, 3, 43-65, https://doi.org/10.1300/J044v12n03_04
. [all data]
Soumaghi, Amin, et al., 2006
Soumaghi, M.H.S.; Amin, G.; Samadi, N.,
Chemical composition and antimicrobial activity of essential oil of Salvia spinosa L.,
Asian J. Plant Sci., 2006, 5, 4, 654-656, https://doi.org/10.3923/ajps.2006.654.656
. [all data]
Tognolini, Barocelli, et al., 2006
Tognolini, M.; Barocelli, E.; Ballabeni, V.; Bruni, R.; Bianchi, A.; Chiavarini, M.; Impicciatore, M.,
Comparative screening of plant essential oils: Phenylpropanoid moiety as basic core for antiplatelet activity,
Life Sciences, 2006, 78, 13, 1419-1432, https://doi.org/10.1016/j.lfs.2005.07.020
. [all data]
Bagci and Baser, 2005
Bagci, E.; Baser, K.H.C.,
Study of the essential oils of Thymus haussknechtii Velen and Thymus kotschyanus Boiss. et Hohen var. kotschyanus (Lamiaceae) taxa from the eastern Anatolian region in Turkey,
Flavour Fragr. J., 2005, 20, 2, 199-202, https://doi.org/10.1002/ffj.1397
. [all data]
Butkienë, Nivinskienë, et al., 2005
Butkienë, R.; Nivinskienë, O.; Mockutë, D.,
α-Pinene chemotype of leaf (needle) essential oils of Juniperus communis L. growing wild in Vilnius district,
Chemija, 2005, 16, 1, 53-60. [all data]
Figueiredo, Sim-Sim, et al., 2005
Figueiredo, A.C.; Sim-Sim, M.; Costa, M.M.; Barroso, J.G.; Pedro, L.G.; Esquível, M.G.; Gutierres, F.; Lobo, C.; Fontinha, S.,
Comparison of the essential oil composition of four Plagiochila species: P. bifaria, P. maderensis, P. retrorsa and P. stricta,
Flavour Fragr. J., 2005, 20, 6, 703-709, https://doi.org/10.1002/ffj.1627
. [all data]
Hamm, Bleton, et al., 2005
Hamm, S.; Bleton, J.; Connan, J.; Tchapla, A.,
A chemical investigation by headspace SPME and GC-MS of volatile and semi-volatile terpenes in various olibanum samples,
Phytochemistry, 2005, 66, 12, 1499-1514, https://doi.org/10.1016/j.phytochem.2005.04.025
. [all data]
Nivinskienë, Butkienë, et al., 2005
Nivinskienë, O.; Butkienë, R.; Mockutë, D.,
Chemical composition of seed (fruit) essential oils of Angelica archangelica L. growing wild in Lithuania,
Chemija, 2005, 16, 3-4, 51-54. [all data]
Radudienë, Judpintienë, et al., 2005
Radudienë, J.; Judpintienë, A.; Peèiulytë, D.; Janulis, V.,
Chemical composition of essential oil and antimicrobial activity of Origanum vulgare,
Biologija, 2005, 4, 53-58. [all data]
Butkienë, Nivinskienë, et al., 2004
Butkienë, R.; Nivinskienë, O.; Mockutë, D.,
Chemical composition of unripe and ripe berry essential oils of Juniperus communis L. growing wild in Vilnius district,
Chemija, 2004, 15, 4, 57-63. [all data]
Couladis, Özcan, et al., 2004
Couladis, M.; Özcan, M.; Tzakou, O.; Akgül, A.,
Menengic (Pistacia terebinthus L.) agacinin degisik organlarinda ucucu yag bilesimi, Bitkisel Ilac Hammaddeleri Toplantisi, Bildiriler, 29-31 Mayis 2002, 2004, 6. [all data]
El-Shazly and Hussein, 2004
El-Shazly, A.M.; Hussein, K.T.,
Chemical analysis and biological activities of the essential oil of Teucrium leucocladum Boiss. (Lamiaceae),
Biochem. Syst. Ecol., 2004, 32, 7, 665-674, https://doi.org/10.1016/j.bse.2003.12.009
. [all data]
Hamm, Bleton, et al., 2004
Hamm, S.; Bleton, J.; Tchapla, A.,
Headspace solid phase microextraction for screening for the presence of resins in Egyptian archaeological samples,
J. Sep. Sci., 2004, 27, 3, 235-243, https://doi.org/10.1002/jssc.200301611
. [all data]
Judpentienë and Mockutë, 2004
Judpentienë, A.; Mockutë, D.,
Chemical composition of essential oils produced by pink flower inflorescences of wild Achillea millefolium L.,
Chemija, 2004, 15, 28-32. [all data]
Judpentienë and Mockutë, 2004, 2
Judpentienë, A.; Mockutë, D.,
Chemical composition of essential oils of Artemisia absinthium L. (wormwood) growing wild in Vilnius,
Chemija, 2004, 15, 4, 64-68. [all data]
Miguel, Simões, et al., 2004
Miguel, G.; Simões, M.; Figueiredo, A.C.; Barroso, J.G.; Pedro, L.G.; Carvalho, L.,
Composition and antioxidant activities of the essential oils of Thymus caespititius, Thymus camphoratus and Thymus mastichina,
Food Chem., 2004, 86, 2, 183-188, https://doi.org/10.1016/j.foodchem.2003.08.031
. [all data]
Mockutë, Bernotienë, et al., 2004
Mockutë, D.; Bernotienë, G.; Judbentienë, A.,
Chemical composition of essential oils of Origanum vulgare L. growing in Lithuania,
Biologija, 2004, 4, 44-49. [all data]
Mockutë, Judbentienë, et al., 2004
Mockutë, D.; Judbentienë, A.; Bernotienë, G.,
Volatile constituents of cultivated Origanum vulgare L. inflorescences and leaves,
Chemija, 2004, 15, 1, 33-37. [all data]
Sahin, Gulluce, et al., 2004
Sahin, F.; Gulluce, M.; Daferera, D.; Sokmen, A.; Sokmen, M.; Polissiou, M.; Agar, G.; Ozer, H.,
Biological activities of the essential oils and methanol extract of Origanum vulgare ssp. vulgare in the Eastern Anatolia region of Turkey,
Food Control, 2004, 15, 7, 549-557, https://doi.org/10.1016/j.foodcont.2003.08.009
. [all data]
Senatore, Apostolides Arnold, et al., 2004
Senatore, F.; Apostolides Arnold, N.; Piozzi, F.,
Chemical composition of the essential oil of Salvia multicaulis Vahl. var. simplicifolia Boiss. growing wild in Lebanon,
J. Chromatogr. A, 2004, 1052, 1-2, 237-240, https://doi.org/10.1016/j.chroma.2004.08.095
. [all data]
Vinogradov, 2004
Vinogradov, B.A.,
Production, composition, properties and application of essential oils, 2004, retrieved from http://viness.narod.ru. [all data]
Hamm, Lesellier, et al., 2003
Hamm, S.; Lesellier, E.; Bleton, J.; Tchapla, A.,
Optimization of headspace solid phase microextraction for gas chromatography/mass spectrometry analysis of widely different volatility and polarity terpenoids in olibanum,
J. Chromatogr. A, 2003, 1018, 1, 73-83, https://doi.org/10.1016/j.chroma.2003.08.027
. [all data]
Mockute, Bernotiene, et al., 2003
Mockute, D.; Bernotiene, G.; Judzentiene, A.,
Volatile compounds of the aerial parts of wild St. John's wort (Hypericum perforatum L.) plants,
Chemija, 2003, 14, 3, 108-111. [all data]
Mockute, Bernotiene, et al., 2003, 2
Mockute, D.; Bernotiene, G.; Judzentiene, A.,
The β-ocimene chemotype of essential oils of the inflorescences and the leaves with stems from Origanum vulgare ssp. vulgare growing wild in Lithuania,
Biochem. Syst. Ecol., 2003, 31, 3, 269-278, https://doi.org/10.1016/S0305-1978(02)00151-5
. [all data]
Mockute, Nivinskiene, et al., 2003
Mockute, D.; Nivinskiene, O.; Bernotiene, G.; Butkiene, R.,
The cis-thujone chemotype of Salvia officinalis L. essential oils,
Chemija, 2003, 14, 4, 216-220. [all data]
Silva, Matos, et al., 2003
Silva, M.G.V.; Matos, F.J.A.; Machado, M.I.L.; Craveiro, A.A.,
Essential oils of Ociumum basilicum L., O. basilicum. var. minimum L. and O. basilicum. var. purpurascens Benth. grown in north-eastern Brazil,
Flavour Fragr. J., 2003, 18, 1, 13-14, https://doi.org/10.1002/ffj.1134
. [all data]
Veres, Varga, et al., 2003
Veres, K.; Varga, E.; Dobos, Á.; Hajdú, Zs.; Máthé, I.; Németh, É.; Szabó, K.,
Investigation of the composition and stability of the essential oils of origanum vulgare ssp. vulgare L. and O. vulgare ssp. hirtum (Link) letswaart,
Chromatographia, 2003, 57, 1/2, 95-98, https://doi.org/10.1007/BF02497483
. [all data]
Mockute and Judzentiene, 2002
Mockute, D.; Judzentiene, A.,
Chemotypes of the essential oils of Achillea millefolium L. ssp. millefolium growing wild in Eastern Lithuania,
Chemija, 2002, 13, 3, 168-173. [all data]
Mockute and Judzentiene, 2002, 2
Mockute, D.; Judzentiene, A.,
Chemical composition of the essential oils of Achillea millefolium L. ssp. millefolium (yarrow) growing wild in Vilnius,
Chemija, 2002, 13, 2, 97-102. [all data]
Ferreira, Costantin, et al., 2001
Ferreira, M.J.P.; Costantin, M.B.; Sartorelli, P.; Rodrigues, G.V.; Limberger, R.; Henriques, A.T.; Kato, M.J.; Emerenciano, V.P.,
Computer-aided method for identification of components in essential oils by 13C NMR spectroscopy,
Anal. Chim. Acta., 2001, 447, 1-2, 125-134, https://doi.org/10.1016/S0003-2670(01)01204-1
. [all data]
Figueiredo, Miguel, et al., 2001
Figueiredo, A.C.; Miguel, M.G.; Duarte, A.M.F.; Barroso, J.G.; Pedro, L.G.,
Essential oil composition of Thymus lotocephallus G. López R. Morales, collected during flowering and vegetative phases,
Flavour Fragr. J., 2001, 16, 6, 417-421, https://doi.org/10.1002/ffj.1028
. [all data]
da Silva, Pedro, et al., 2000
da Silva, J.A.; Pedro, L.G.; Santos, P.A.G.; Figueiredo, A.C.; Barroso, J.G.; Tenreiro, R.P.; Ribeiro, C.A.; Deans, S.G.; Looman, A.; Scheffer, J.J.C.,
Essential oils from seven populations of Juniperus brevifolia (Seub.) Antoine, an endemic species of the Azores,
Flavour Fragr. J., 2000, 15, 1, 31-39, https://doi.org/10.1002/(SICI)1099-1026(200001/02)15:1<31::AID-FFJ862>3.0.CO;2-C
. [all data]
Weyerstahl, Marschall, et al., 1999
Weyerstahl, P.; Marschall, H.; Son, P.T.; Giang, P.M.,
Constituents of the flower essential oil of Aglaia odorata Lour. from Vietnam,
Flavour Fragr. J., 1999, 14, 4, 219-224, https://doi.org/10.1002/(SICI)1099-1026(199907/08)14:4<219::AID-FFJ815>3.0.CO;2-#
. [all data]
Baratta, Dorman, et al., 1998
Baratta, M.T.; Dorman, H.J.; Deans, S.G.; Figueiredo, A.C.; Barroso, J.G.; Ruberto, G.,
Antimicrobial and antioxidant properties of some commercial essential oils,
Flavour Fragr. J., 1998, 13, 4, 235-244, https://doi.org/10.1002/(SICI)1099-1026(1998070)13:4<235::AID-FFJ733>3.0.CO;2-T
. [all data]
Kökdil, 1998
Kökdil, G.,
Composition of the essential oil of Clinopodium vulgare L. ssp. arundanum (Boiss.) Nyman collected from two different localities in Turkey,
Flavour Fragr. J., 1998, 13, 3, 170-172, https://doi.org/10.1002/(SICI)1099-1026(199805/06)13:3<170::AID-FFJ721>3.0.CO;2-H
. [all data]
Yusuf, Begum, et al., 1998
Yusuf, M.; Begum, J.; Mondello, L.; Stagno d'Alcontres, I.S.,
Studies on the essential oil bearing plants of Bangladesh. Part VI. Composition of the oil of Ocimum gratissimum L.,
Flavour Fragr. J., 1998, 13, 3, 163-166, https://doi.org/10.1002/(SICI)1099-1026(199805/06)13:3<163::AID-FFJ714>3.0.CO;2-1
. [all data]
Mariaca, Berger, et al., 1997
Mariaca, R.G.; Berger, T.F.H.; Gauch, R.; Imhof, M.I.; Jeangros, B.; Bosset, J.O.,
Occurrence of volatile mono- and sesquiterpenoids in highland and lowland plant species as possible precursors for flavor compounds in milk and dairy products,
J. Agric. Food Chem., 1997, 45, 11, 4423-4434, https://doi.org/10.1021/jf970216t
. [all data]
Weyerstahl, Marschall, et al., 1997
Weyerstahl, P.; Marschall, H.; Seelmann, I.; Kaul, V.K.,
Constituents of the flower essential oil of Ageratina adenophora (Spreng.) K. et R. from India,
Flavour Fragr. J., 1997, 12, 6, 387-396, https://doi.org/10.1002/(SICI)1099-1026(199711/12)12:6<387::AID-FFJ677>3.0.CO;2-F
. [all data]
Barroso, Figueiredo, et al., 1996
Barroso, J.G.; Figueiredo, A.C.; Pedro, L.G.; Antunes, T.; Sevinate-Pinto, I.; Fontinha, S.S.; Scheffer, J.J.C.,
Composition of the essential oil of teucrium heterophyllum L'Her. Grown on Madiera,
Flavour Fragr. J., 1996, 11, 2, 129-132, https://doi.org/10.1002/(SICI)1099-1026(199603)11:2<129::AID-FFJ550>3.0.CO;2-Z
. [all data]
Zenkevich, 1996
Zenkevich, I.G.,
Analytical Parameters of Components of Essential Oils for their Chromatographic and Chromato-Mass Spectral Identification. Mono- and Sesquiterpenes,
Rastitelnye Resursy (Plant resources), 1996, 34, 1-2, 48-58. [all data]
Miller, Bills, et al., 1989
Miller, R.L.; Bills, D.D.; Buttery, R.G.,
Volatile components from Barlett and Bradford pear leaves,
J. Agric. Food Chem., 1989, 37, 6, 1476-1479, https://doi.org/10.1021/jf00090a005
. [all data]
De Pooter and Schamp, 1987
De Pooter, H.L.; Schamp, N.M.,
The Essential Oil of Mentha X villosa nm. alopecuroides,
Flavour Fragr. J., 1987, 2, 4, 163-165, https://doi.org/10.1002/ffj.2730020405
. [all data]
Shibamoto, 1987
Shibamoto, T.,
Retention Indices in Essential Oil Analysis
in Capillary Gas Chromatography in Essential Oil Analysis, Sandra, P.; Bicchi, C., ed(s)., Hutchig Verlag, Heidelberg, New York, 1987, 259-274. [all data]
Niponsak, Laohakunjit, et al., 2011
Niponsak, A.; Laohakunjit, N.; kerdchoechuen, O.,
Changes of volatile compounds and physicochemical qualities of fresh cut Pomelo during storage,
Agricultural Sci., 2011, 42, 2, 109-112. [all data]
Karlsson, Birgersson, et al., 2009
Karlsson, M.F.; Birgersson, G.; Prado, A.M.C.; Bosa, F.; Bengtsson, M.; Witzgall, P.,
Plant Odor Analysis of Potato: Responce of Guatemalan Moth to Above- and Background Potato Volatiles,
J. Agric. Food Chem., 2009, 57, 13, 5903-5909, https://doi.org/10.1021/jf803730h
. [all data]
Guo, Wu, et al., 2008
Guo, L.; Wu, J.-Z.; Han, T.; Cao, T.; Rahman, K.; Qin, L.-P.,
Chemical composition, antifungal and antitumor properties of ether extracts of Scapania verrucosa Heeg. and its endophytic fungus Chaetomium fusiforme,
Molecules, 2008, 13, 9, 2114-2125, https://doi.org/10.3390/molecules13092114
. [all data]
Kurose, Okamura, et al., 2007
Kurose, K.; Okamura, D.; Yatagai, M.,
Composition of the essential oils from the leaves of nine Pinus species and the cones of three of Pinus species,
Flavour Fragr. J., 2007, 22, 1, 10-20, https://doi.org/10.1002/ffj.1609
. [all data]
Singh, Kumar, et al., 2007
Singh, B.; Kumar, R.; Bhandari, S.; Pathania, S.; Lal, B.,
Volatile constituents of natural Boswellia serrata oleo-gum-resin and commercial samples,
Flavour Fragr. J., 2007, 22, 2, 145-147, https://doi.org/10.1002/ffj.1772
. [all data]
Cai, Lin, et al., 2006
Cai, J.; Lin, P.; Zhu, X.; Su, Q.,
Comparative analysis of clary sage (S. sclarea L.) oil volatiles by GC-FTIR and GC-MS,
Food Chem., 2006, 99, 2, 401-407, https://doi.org/10.1016/j.foodchem.2005.07.041
. [all data]
Bezic, Skocibusic, et al., 2005
Bezic, N.; Skocibusic, M.; Dunkic, V.,
Phytochemical Composition and Antimicrobial Activityof Satureja montana L. and Satureja cunefolia Ten. Essential Oils,
Acta Bot. Croat., 2005, 64, 2, 313-322. [all data]
Jirovetz, Buchbauer, et al., 2005
Jirovetz, L.; Buchbauer, G.; Stoyanova, A.; Balinova, A.; Guangjiun, Z.; Xihan, M.,
Solid phase microextraction/gas chromatographic and olfactory analysis of the scent and fixative properties of the essential oil of Rosa damascena L. from China,
Flavour Fragr. J., 2005, 20, 1, 7-12, https://doi.org/10.1002/ffj.1375
. [all data]
Kulisic, Radonic, et al., 2005
Kulisic, T.; Radonic, A.; Milos, M.,
Inhibition of Lard Oxidation by Fractions of Different Essential Oil,
Grasas y Aceites, 2005, 56, 4, 284-291, https://doi.org/10.3989/gya.2005.v56.i4.94
. [all data]
Palá-Paúl, Brophy, et al., 2004
Palá-Paúl, J.; Brophy, J.J.; Goldsack, R.J.; Fontaniella, B.,
Analysis of the volatile components of Lavandula canariensis (L.) Mill., a Canary Islands endemic species, growing in Australia,
Biochem. Syst. Ecol., 2004, 32, 1, 55-62, https://doi.org/10.1016/S0305-1978(03)00177-7
. [all data]
Suleimenov, Atazharova, et al., 2003
Suleimenov, E.M.; Atazharova, G.A.; Demirchi, B.; Baser, K.H.C.; Adekenov, S.M.,
Essential oil composition of Artemisia Lercheana and A. Sieversiana of Kazakhstan flora
in Recent problems of development of new medicines of natural origin, Proceedings of symposium, St.Petersburg - Pushkin, 2003, 382-385. [all data]
Kasali, Winterhalter, et al., 2002
Kasali, A.A.; Winterhalter, P.; Adio, A.M.; Knapp, H.; Bonnlander, B.,
Chromenes in Ageratum conyzoides L.,
Flavour Fragr. J., 2002, 17, 4, 247-250, https://doi.org/10.1002/ffj.1099
. [all data]
Buttery, Light, et al., 2000
Buttery, R.G.; Light, D.M.; Nam, Y.; Merrill, G.B.; Roitman, J.N.,
Volatile components of green walnut husks,
J. Agric. Food Chem., 2000, 48, 7, 2858-2861, https://doi.org/10.1021/jf000288b
. [all data]
Chagonda, Makanda, et al., 2000, 2
Chagonda, L.S.; Makanda, C.; Chalchat, J.-C.,
The essential oils of wild and cultivated Cymbopogon validus (Stapf) Stapf ex Burtt Davy and Elionurus muticus (Spreng.) Kunth from Zimbabwe,
Flavour Fragr. J., 2000, 15, 2, 100-104, https://doi.org/10.1002/(SICI)1099-1026(200003/04)15:2<100::AID-FFJ874>3.0.CO;2-Y
. [all data]
Kaya, Baser, et al., 1999
Kaya, A.; Baser, K.H.C.; Koca, F.,
Essential oils of Acinos troodi (Post) Leblebici subsp. vardaranus Leblebici and subsp. grandiflorus Hartvig Strid,
Flavour Fragr. J., 1999, 14, 1, 50-54, https://doi.org/10.1002/(SICI)1099-1026(199901/02)14:1<50::AID-FFJ783>3.0.CO;2-7
. [all data]
Kaya, Baser, et al., 1999, 2
Kaya, A.; Baser, K.H.C.; Demirci, B.; Koca, F.,
The essential oil of Acinos alpinus (L.) Moench growing in Turkey,
Flavour Fragr. J., 1999, 14, 1, 55-59, https://doi.org/10.1002/(SICI)1099-1026(199901/02)14:1<55::AID-FFJ784>3.0.CO;2-Q
. [all data]
Kaya, Baser, et al., 1999, 3
Kaya, A.; Baser, K.H.C.; Tümen, G.; Koca, F.,
The essential oil of Acinos suaveolens (Sm.) G. Don fil. Acinos arvensis (Lam.) Dandy and Acinos rotundifolius Pers. growing wild in Turkey,
Flavour Fragr. J., 1999, 14, 1, 60-64, https://doi.org/10.1002/(SICI)1099-1026(199901/02)14:1<60::AID-FFJ785>3.0.CO;2-0
. [all data]
Onocha, Ekundayo, et al., 1999
Onocha, P.A.; Ekundayo, O.; Oyelola, O.; Laakso, I.,
Essential oils of Dacryodes edulis (G. Don) H. J. Lam (African pear),
Flavour Fragr. J., 1999, 14, 2, 135-139, https://doi.org/10.1002/(SICI)1099-1026(199903/04)14:2<135::AID-FFJ788>3.0.CO;2-L
. [all data]
Molleken U., Sinnwell V., et al., 1998
Molleken U.; Sinnwell V.; Kubeczka K.H.,
TThe essential oil composition of fruits from Smyrnium perfoliatum,
Phytochemistry, 1998, 47, 6, 1079-1083, https://doi.org/10.1016/S0031-9422(98)80076-9
. [all data]
Mölleken, Sinnwell, et al., 1998
Mölleken, U.; Sinnwell, V.; Kubeczka, K.-H.,
Essential oil composition of Smyrnium olusatrum,
Phytochemistry, 1998, 49, 6, 1709-1714, https://doi.org/10.1016/S0031-9422(98)00195-2
. [all data]
Tümen, Baser, et al., 1998
Tümen, G.; Baser, K.H.C.; Demirci, B.; Ermin, N.,
The essential oils of Satureja coerulea Janka and Thymus aznavourii Velen.,
Flavour Fragr. J., 1998, 13, 1, 65-67, https://doi.org/10.1002/(SICI)1099-1026(199801/02)13:1<65::AID-FFJ695>3.0.CO;2-Q
. [all data]
Baser, Kirimer, et al., 1997
Baser, K.H.C.; Kirimer, N.; Duman, H.,
Composition of the essential oil of Micromeria dolichodontha P. H. Davis,
Flavour Fragr. J., 1997, 12, 4, 289-291, https://doi.org/10.1002/(SICI)1099-1026(199707)12:4<289::AID-FFJ640>3.0.CO;2-A
. [all data]
Pollak and Berger, 1996
Pollak, F.C.; Berger, R.G.,
Geosmin and Related Volatiles in Bioreactor-Cultured Streptomyces citreus CBS 109.60,
Appl. Environ. Microbiol., 1996, 62, 4, 1295-1299. [all data]
Gaydou, Faure, et al., 1989
Gaydou, E.M.; Faure, R.; Bianchini, J.-P.; Lamaty, G.; Rakotonirainy, O.; Randriamiharisoa, R.,
Sesquiterpene composition of basil oil. Assignment of the 1H and 13C NMR spectra of β-elemene with two-dimensional NMR,
J. Agric. Food Chem., 1989, 37, 4, 1032-1037, https://doi.org/10.1021/jf00088a048
. [all data]
Akin, Saracoglu, et al., 2012
Akin, M.; Saracoglu, H.T.; Demirci, B.; Baser, K.H.C.,
Chemical composition and antibacterial activity of essential oils from different parts of Buplerum rotundifolium L.,
Rec. Nat. Prod., 2012, 6, 3, 316-320. [all data]
Bardakci, Demirci, et al., 2012
Bardakci, H.; Demirci, B.; Yesilada, E.; Kirmizibekmez, H.; Naser, K.H.C.,
Chemical composition of the essential oil of the subterranean parts of Valeriana alliariifolia,
Rec. Nat. Prod., 2012, 6, 1, 89-92. [all data]
Noorizadeh, Farmany, et al., 2011
Noorizadeh, H.; Farmany, A.; Noorizadeh, M.,
Quantitative structure-retention relationships analysis of retention index of essential oils,
Quim. Nova, 2011, 34, 2, 242-249, https://doi.org/10.1590/S0100-40422011000200014
. [all data]
Noorizadeh and Farmany, 2010
Noorizadeh, H.; Farmany, A.,
Exploration of linear and nonlinear modeling techniques to predict of retention index of essential oils,
J. Chin. Chem. Soc., 2010, 1268-1277. [all data]
Kaya, Benirci, et al., 2007
Kaya, A.; Benirci, B.; Baser, K.H.C.,
Micromorphology of glandular trichomes of Nepeta congesta Fisch. Mey. var. congesta (LAmiaceae) and chemical analysis of the essential oils,
South African J. Botany, 2007, 73, 1, 29-34, https://doi.org/10.1016/j.sajb.2006.05.004
. [all data]
Baser K.H.C., Ozek G., et al., 2006
Baser K.H.C.; Ozek G.; Ozek T.; Duran A.,
Composition of the essential oil of Centaurea huber-morathii Wagenitz isolated from seeds by microdistillation,
Flavour Fragr. J., 2006, 21, 3, 568-570, https://doi.org/10.1002/ffj.1620
. [all data]
Baser, Özek, et al., 2006
Baser, K.H.C.; Özek, G.; Özek, T.; Duran, A.; Duman, H.,
Composition of the essential oils of Rhabdosciadium oligocarpum (Post ex Boiss.) Hedge et Lamond and Rhabdosciadium microcalycinum Hand.-Mazz.,
Flavour Fragr. J., 2006, 21, 4, 650-655, https://doi.org/10.1002/ffj.1639
. [all data]
Erdurak, Coskun, et al., 2006
Erdurak, C.S.; Coskun, M.; Demirci, B.; Baser, K.H.C.,
Composition of the essential oil of fruits and roots of Ferulago isaurica Pesmen and F. syriaca Boiss. (Umbelliferae) from Turkey,
Flavour Fragr. J., 2006, 21, 1, 118-121, https://doi.org/10.1002/ffj.1540
. [all data]
Tabanca, Demirci, et al., 2006
Tabanca, N.; Demirci, B.; Ozek, T.; Kirimer, N.; Can Baser, K.H.; Bedir, E.; Khan, I.A.; Wedge, D.E.,
Gas chromatographic-mass spectrometric analysis of essential oils from Pimpinella species gathered from Central and Northern Turkey,
J. Chromatogr. A, 2006, 1117, 2, 194-205, https://doi.org/10.1016/j.chroma.2006.03.075
. [all data]
Demirci, Demirci, et al., 2005
Demirci, B.; Demirci, F.; Dönmez, A.A.; Franz, G.; Paper, D.H.; Baser, K.H.C.,
Effects of Salvia essential oils on the chorioallantoic membrane (CAM) assay,
Pharm. Biol., 2005, 43, 8, 666-671, https://doi.org/10.1080/13880200500383397
. [all data]
Duman, Kartal, et al., 2005
Duman, H.; Kartal, M.; Altun, L.; Demirci, B.; Baser, K.H.C.,
The essential oil of Stachys laetivirens Kotschy Boiss. ex Rech. fil., endemic in Turkey,
Flavour Fragr. J., 2005, 20, 1, 48-50, https://doi.org/10.1002/ffj.1362
. [all data]
Sezik E., Kocakulak E., et al., 2005
Sezik E.; Kocakulak E.; Baser K.H.C.; Ozek T.,
Composition of the essential oils of Juniperus oxycedrus subsp macrocarpa from Turkey,
Chem. Nat. Compd. (Engl. Transl.), 2005, 41, 3, 352-354, https://doi.org/10.1007/s10600-005-0149-0
. [all data]
Tabanca, Demirci, et al., 2005
Tabanca, N.; Demirci, B.; Kirimer, N.; Baser, K.H.C.; Bedir, E.; Khand, I.A.; Wedge, D.E.,
Gas chromatographic-mass spectrometric analysis of essential oils from Pimpinella aurea, Pimpinella corymbosa, Pimpinella peregrina and Pimpinella puberula gathered from Eastern and Southern Turkey,
J. Chromatogr. A, 2005, 1097, 1-2, 192-198, https://doi.org/10.1016/j.chroma.2005.10.047
. [all data]
Viljoen, Subramoney, et al., 2005
Viljoen, A.M.; Subramoney, S.; van Vuuren, S.F.; Baser, K.H.C.; Demirci, B.,
The composition, geographical variation and antimicrobial activity of Lippia javanica (Verbenaceae) leaf essential oils,
J. Ethnopharmacol., 2005, 96, 1-2, 271-277, https://doi.org/10.1016/j.jep.2004.09.017
. [all data]
Altintas, Kose, et al., 2004
Altintas, A.; Kose, Y.B.; Yucel, E.; Demirci, B.; Baser, K.H.C.,
Composition of the essential oil of Centaurea dichroa,
Chem. Nat. Compd. (Engl. Transl.), 2004, 40, 6, 604-605, https://doi.org/10.1007/s10600-005-0051-9
. [all data]
Demirci, Paper, et al., 2004
Demirci, F.; Paper, D.H.; Demirci, F.; Hüsnü Can Baser, K.; Franz, G.,
Essential oil of Betula pendula Roth. buds,
eCAM, 2004, 1, 3, 301-303. [all data]
Kivcak, Akay, et al., 2004
Kivcak, B.; Akay, S.; Demirci, B.; Baser, K.H.C.,
Chemical composition of essential oils from leaves and twigs of Pistacia lentiscus, Pistacia lentiscus var. chia, and Pistacia terebinthus from Turkey,
Pharm. Biol, 2004, 42, 4-5, 360-366, https://doi.org/10.1080/13880200490519677
. [all data]
Baser, Demirci, et al., 2003
Baser, K.H.C.; Demirci, B.; Dekebo, A.; Dagne, E.,
Essential oils of some Boswellia spp., myrrh and opopanax,
Flavour Fragr. J., 2003, 18, 2, 153-156, https://doi.org/10.1002/ffj.1166
. [all data]
Demirci, Baser, et al., 2003
Demirci, B.; Baser, K.H.C.; Yildiz, B.; Bahcecioglu, Z.,
Composition of the essential oils of six endemic Salvia spp. from Turkey,
Flavour Fragr. J., 2003, 18, 2, 116-121, https://doi.org/10.1002/ffj.1173
. [all data]
Demirci, Dadandi, et al., 2003
Demirci, B.; Dadandi, M.Y.; Paper, D.H.; Franz, G.; Hüsnü Can Baser, K.,
Chemical Composition of the Essential Oil of Phlomis linearis Boiss. Bal., and Biological Effects on the CAM-Assay: A Safety Evaluation,
Z. Naturforsch. C:, 2003, 58, 826-829. [all data]
Baser, Demirci, et al., 2002
Baser, K.H.C.; Demirci, B.; Kirimer, N.; Satil, F.; Tumen, G.,
The essential oils of Thymus migricus and T. fedtschenkoi var. handelii from Turkey,
Flavour Fragr. J., 2002, 17, 1, 41-45, https://doi.org/10.1002/ffj.1036
. [all data]
Baser, Demirei, et al., 2002
Baser, K.H.C.; Demirei, B.; Özek, T.; Akalin, E.; Özhatay, N.,
Micro-distilled volatile compounds from Ferulago species growing in Western Turkey,
Pharm. Biol., 2002, 40, 6, 466-471, https://doi.org/10.1076/phbi.40.6.466.8439
. [all data]
Kaya, Demirci, et al., 2001
Kaya, A.; Demirci, B.; Baser, K.H.C.,
The composition of the essential oil of Stachys iberica subsp. stenostachya growing in Turkey,
Chem. Nat. Compd. (Engl. Transl.), 2001, 37, 4, 326-328, https://doi.org/10.1023/A:1013762200024
. [all data]
Kirimer N., Tabanea N., et al., 2001
Kirimer N.; Tabanea N.; Demirci B.; Baser K.H.C.; Duman H.; Aytac Z.,
The essential oil of a new Sideritis species: Sideritis ozturkii Aytac and Aksoy,
Chem. Nat. Compd. (Engl. Transl.), 2001, 37, 3, 234-237, https://doi.org/10.1023/A:1012561806033
. [all data]
Saglam, Gozler, et al., 2001
Saglam, H.; Gozler, T.; Kivcak, B.; Demirci, B.; Baser, K.H.C.,
Volatile compounds from Haplophyllum myrtifolium,
Chem. Nat. Compd. (Engl. Transl.), 2001, 37, 5, 442-444, https://doi.org/10.1023/A:1014467225815
. [all data]
Tabanca N., Demirci F., et al., 2001
Tabanca N.; Demirci F.; Ozek T.; Tumen G.; Baser K.H.C.,
Composition and antimicrobial activity of the essential oil of Origanum x dolichosiphon P. H. Davis,
Chem. Nat. Compd. (Engl. Transl.), 2001, 37, 3, 238-241, https://doi.org/10.1023/A:1012513922871
. [all data]
Tabanca, Kirimer, et al., 2001
Tabanca, N.; Kirimer, N.; Can Baser, K.H.,
The composition of essential oils from two varieties of Sideritis erythrantha var. erythrantha and var. cedretorum,
Turk. J. Chem., 2001, 25, 201-208. [all data]
Ahmed, Choudhary, et al., 2000
Ahmed, A.; Choudhary, M.I.; Farooq, A.; Demirci, B.; Demirci, F.; Baser, K.H.C.,
Essential oil constituents of the spice Cinnamomum tamala (Ham.) Nees Eberm.,
Flavour Fragr. J., 2000, 15, 6, 388-390, https://doi.org/10.1002/1099-1026(200011/12)15:6<388::AID-FFJ928>3.0.CO;2-F
. [all data]
Baser, Özek, et al., 2000, 2
Baser, K.H.C.; Özek, T.; Demirci, B.; Duman, H.,
Composition of the essential oil of Prangos heyniae H. Duman et M. F. Watson, a new endemic from Turkey,
Flavour Fragr. J., 2000, 15, 1, 47-49, https://doi.org/10.1002/(SICI)1099-1026(200001/02)15:1<47::AID-FFJ869>3.0.CO;2-9
. [all data]
Baser, Tabanca, et al., 2000
Baser, K.H.C.; Tabanca, N.; Özek, T.; Demirci, B.; Duran, A.; Duman, H.,
Composition of the essential oil of Chaerophyllum aksekiense A. Duran et Duman, a recently described endemic from Turkey,
Flavour Fragr. J., 2000, 15, 1, 43-44, https://doi.org/10.1002/(SICI)1099-1026(200001/02)15:1<43::AID-FFJ864>3.0.CO;2-#
. [all data]
Kirimer, Tabanca, et al., 2000
Kirimer, N.; Tabanca, N.; Özek, T.; Tümen, G.; Baser, K.H.C.,
Essential oils of annual Sideritis species growing in Turkey,
Pharm. Biol., 2000, 38, 2, 106-111, https://doi.org/10.1076/1388-0209(200004)3821-1FT106
. [all data]
Kirimer, Tabanca, et al., 1999
Kirimer, N.; Tabanca, N.; Ozek, T.; Basher, K.H.C.; Tumen, G.,
Composition of essential oils from two endemic Sideritis species of Turkey,
Chem. Natural Comp., 1999, 35, 1, 61-64, https://doi.org/10.1007/BF02238211
. [all data]
Vernin, 1991
Vernin, G.,
Volatile constituents of the essential oil of Santolina chamaecyparissus L.,
J. Essent. Oil Res., 1991, 3, 1, 49-53, https://doi.org/10.1080/10412905.1991.9697907
. [all data]
Waggott and Davies, 1984
Waggott, A.; Davies, I.W.,
Identification of organic pollutants using linear temperature programmed retention indices (LTPRIs) - Part II, 1984, retrieved from http://dwi.defra.gov.uk/research/completed-research/reports/dwi0383.pdf. [all data]