3-Pentenoic acid
- Formula: C5H8O2
- Molecular weight: 100.1158
- IUPAC Standard InChIKey: UIUWNILCHFBLEQ-UHFFFAOYSA-N
- CAS Registry Number: 5204-64-8
- Chemical structure:
View 3d structure (requires JavaScript / HTML 5) - Stereoisomers:

Condensed phase thermochemistry data

Data compiled by: Hussein Y. Afeefy, Joel F. Liebman, and Stephen E. Stein
Quantity | Value | Units | Method | Reference | Comment |
---|---|---|---|---|---|
ΔcH°liquid | -2676.1 ± 2.1 | kJ/mol | Ccb | Schjanberg, 1937 | Reanalyzed by Cox and Pilcher, 1970, Original value = -2675. ± 8. kJ/mol; At 293 K; Corresponding ΔfHºliquid = -434.80 kJ/mol (simple calculation by NIST; no Washburn corrections) |

Phase change data

Data compiled by: Robert L. Brown and Stephen E. Stein
Reduced pressure boiling point
Tboil (K) | Pressure (bar) | Reference |
---|---|---|
367. to 369. | 0.023 | Frinton Laboratories Inc., 1986 |

References

Schjanberg, 1937
Schjanberg, E.,
Die verbrennungswarmen und die refraktionsdaten einiger pentensaureeste,
Z. Phys. Chem., 1937, 178, 274-281. [all data]
Cox and Pilcher, 1970
Cox, J.D.; Pilcher, G.,
Thermochemistry of Organic and Organometallic Compounds, Academic Press, New York, 1970, 1-636. [all data]
Frinton Laboratories Inc., 1986
Frinton Laboratories Inc.,
Catalog Number 11, Frinton Laboratories Inc., Vineland, NJ, 1986, 99. [all data]