p-Butoxybenzonitrile
- Formula: C11H13NO
- Molecular weight: 175.2270
- IUPAC Standard InChIKey: RRGQINKVTNAIBB-UHFFFAOYSA-N
- CAS Registry Number: 5203-14-5
- Chemical structure:
View 3d structure (requires JavaScript / HTML 5) - Other names: 4-(n-Butoxy)benzonitrile; Benzonitrile, 4-butoxy-

Phase change data

Data compiled by: Robert L. Brown and Stephen E. Stein
Reduced pressure boiling point
Tboil (K) | Pressure (bar) | Reference |
---|---|---|
398. to 399. | 0.0001 | Frinton Laboratories Inc., 1986 |

References

Frinton Laboratories Inc., 1986
Frinton Laboratories Inc.,
Catalog Number 11, Frinton Laboratories Inc., Vineland, NJ, 1986, 99. [all data]