Benzoic acid, 2-amino-5-chloro-, methyl ester
- Formula: C8H8ClNO2
- Molecular weight: 185.608
- IUPAC Standard InChIKey: IGHVUURTQGBABT-UHFFFAOYSA-N
- CAS Registry Number: 5202-89-1
- Chemical structure:
View 3d structure (requires JavaScript / HTML 5) - Other names: Anthranilic acid, 5-chloro-, methyl ester; Methyl 2-amino-5-chlorobenzoate; Methyl 5-chloroanthranilate

Phase change data

Data compiled by: Robert L. Brown and Stephen E. Stein
Quantity | Value | Units | Method | Reference | Comment |
---|---|---|---|---|---|
Tfus | 341. to 343. | K | N/A | Buckingham and Donaghy, 1982 |
Reduced pressure boiling point
Tboil (K) | Pressure (bar) | Reference |
---|---|---|
442.2 | 0.029 | Aldrich Chemical Company Inc., 1990 |
423. to 426. | 0.013 | Buckingham and Donaghy, 1982 |

References

Buckingham and Donaghy, 1982
Buckingham, J.; Donaghy, S.M.,
Dictionary of Organic Compounds: Fifth Edition, Chapman and Hall, New York, 1982, 1. [all data]
Aldrich Chemical Company Inc., 1990
Aldrich Chemical Company Inc.,
Catalog Handbook of Fine Chemicals, Aldrich Chemical Company, Inc., Milwaukee WI, 1990, 1. [all data]