trans-1,2-Dibromocycloheptane
- Formula: C7H12Br2
- Molecular weight: 255.978
- IUPAC Standard InChIKey: PQKOJNVKGNOTKZ-KNVOCYPGSA-N
- CAS Registry Number: 52021-35-9
- Chemical structure:
View 3d structure (requires JavaScript / HTML 5) - Stereoisomers:

Phase change data

Data compiled by: Hussein Y. Afeefy, Joel F. Liebman, and Stephen E. Stein
Quantity | Value | Units | Method | Reference | Comment |
---|---|---|---|---|---|
ΔvapH° | 52.015 | kJ/mol | V | Lister, 1941 |

References

Lister, 1941
Lister, M.W.,
Heats of organic reactions. X. Heats of bromination of cyclic olefins,
J. Am. Chem. Soc., 1941, 63, 143-149. [all data]