Tetraethylene glycol monochlorohydrine
- Formula: C8H17ClO4
- Molecular weight: 212.671
- IUPAC Standard InChIKey: ISYSKYJOWFLWCM-UHFFFAOYSA-N
- CAS Registry Number: 5197-66-0
- Chemical structure:
View 3d structure (requires JavaScript / HTML 5) - Permanent link for this species. Use this link for bookmarking this species for future reference.

Phase change data

Data compiled as indicated in comments:
TRC - Thermodynamics Research Center, NIST Boulder Laboratories, Chris Muzny director
AC - William E. Acree, Jr., James S. Chickos
ALS - Hussein Y. Afeefy, Joel F. Liebman, and Stephen E. Stein
Quantity | Value | Units | Method | Reference | Comment |
---|---|---|---|---|---|
Tfus | 219.15 | K | N/A | Gallaugher and Hibbert, 1936 | Uncertainty assigned by TRC = 3. K; TRC |
Enthalpy of vaporization
ΔvapH (kJ/mol) | Temperature (K) | Method | Reference | Comment |
---|---|---|---|---|
68.6 | 398. | A | Stephenson and Malanowski, 1987 | Based on data from 383. to 555. K. See also Stull, 1947.; AC |
68.53 | 273. | V | Gallaugher and Hibbert, 1937 | ALS |

References

Gallaugher and Hibbert, 1936
Gallaugher, A.F.; Hibbert, H.,
Studies on reactions relating to carbohydrates and polysaccharides: xlix molecular weight, molar refraction, freezing point and other properties of the polyethylene glycols and their derivatives,
J. Am. Chem. Soc., 1936, 58, 813. [all data]
Stephenson and Malanowski, 1987
Stephenson, Richard M.; Malanowski, Stanislaw,
Handbook of the Thermodynamics of Organic Compounds, 1987, https://doi.org/10.1007/978-94-009-3173-2
. [all data]
Stull, 1947
Stull, Daniel R.,
Vapor Pressure of Pure Substances. Organic and Inorganic Compounds,
Ind. Eng. Chem., 1947, 39, 4, 517-540, https://doi.org/10.1021/ie50448a022
. [all data]
Gallaugher and Hibbert, 1937
Gallaugher, A.F.; Hibbert, H.,
Studies on reactions relating to carbohydrates and polysaccharides. LV. Vapor pressures of the polyethylene glycols and their derivatives,
J. Am. Chem. Soc., 1937, 59, 2521-2525. [all data]