2-Pentanone, 5-(acetyloxy)-
- Formula: C7H12O3
- Molecular weight: 144.1684
- IUPAC Standard InChIKey: QYAHGDMPUORRQD-UHFFFAOYSA-N
- CAS Registry Number: 5185-97-7
- Chemical structure:

Reaction thermochemistry data

Data compiled by: Hussein Y. Afeefy, Joel F. Liebman, and Stephen E. Stein
Individual Reactions
By formula: C7H12O3 + H2O = C5H10O2 + C2H4O2
Quantity | Value | Units | Method | Reference | Comment |
---|---|---|---|---|---|
ΔrH° | 12. | kJ/mol | Eqk | Grigor'ev, Katsman, et al., 1981 | liquid phase |

Normal alkane RI, non-polar column, custom temperature program

Column type | Active phase | I | Reference | Comment |
---|---|---|---|---|
Capillary | Polydimethyl siloxanes | 1053. | Zenkevich and Chupalov, 1996 | Program: not specified |

References

Grigor'ev, Katsman, et al., 1981
Grigor'ev, A.A.; Katsman, E.A.; Bobrov, A.F.; Dan'ko, T.N.; Pinkhasik, E.V.,
Preparation of γ-acetopropyl alcohol,
Sov. Chem. Ind. (Engl. Transl.), 1981, 967-972. [all data]
Zenkevich and Chupalov, 1996
Zenkevich, I.G.; Chupalov, A.A.,
New Possibilities of Chromato Mass Pectrometric Identification of Organic Compounds Using Increments of Gas Chromatographic Retention Indices of Molecular Structural Fragments,
Zh. Org. Khim. (Rus.), 1996, 32, 5, 656-666. [all data]