methyl 6-methyldecanoate
- Formula: C12H24O2
- Molecular weight: 200.3178
- IUPAC Standard InChIKey: TXSASZCGLPVDPB-UHFFFAOYSA-N
- CAS Registry Number: 51771-68-7
- Chemical structure:
View 3d structure (requires JavaScript / HTML 5) - Permanent link for this species. Use this link for bookmarking this species for future reference.

Phase change data

Data compiled by: Thermodynamics Research Center, NIST Boulder Laboratories, Chris Muzny director
Quantity | Value | Units | Method | Reference | Comment |
---|---|---|---|---|---|
Tboil | 385. | K | N/A | Schulte, Krause, et al., 1951 | Uncertainty assigned by TRC = 2. K |

References

Schulte, Krause, et al., 1951
Schulte, K.E.; Krause, H.; Kirschner, J.,
Z. Physiol. Chem., 1951, 287, 239. [all data]