Bis(2-chloroethyl)methylamine
- Formula: C5H11Cl2N
- Molecular weight: 156.054
- IUPAC Standard InChIKey: HAWPXGHAZFHHAD-UHFFFAOYSA-N
- CAS Registry Number: 51-75-2
- Chemical structure:
View 3d structure (requires JavaScript / HTML 5) - Other names: HN2; Mustargen; Nitrogen mustard; N-Methyl-lost; Ethanamine, 2-chloro-N-(2-chloroethyl)-N-methyl-; 2,2'-Dichloro-N-methyldiethylamine; Diethylamine, 2,2'-dichloro-N-methyl-; Bis(β-chloroethyl)methylamine; N,N-Bis(2-chloroethyl)methylamine; Chlorethazine; Chlormethine; 2-Chloro-N-(2-chloroethyl)-N-methylethanamine; Cloramin; Dichlor amine; β,β'-Dichlorodiethyl-N-methylamine; 2,2'-Dichlorodiethyl-methylamine; Di(2-chloroethyl)methylamine; N,N-Di(chloroethyl)methylamine; ENT-25294; MBA; Mechlorethamine; Mecloretamina; Methylbis(β-chloroethyl)amine; Methylbis(2-chloroethyl)amine; N-Methyl-bis-chloraethylamin; N-Methyl-bis(β-chloroethyl)amine; N-Methyl-bis(2-chloroethyl)amine; N-Methyl-2,2'-dichlorodiethylamine; Methyldi(2-chloroethyl)amine; Mustine; NSC 762; T-1024; TL 146; Bis(b-chloroethyl)methylamine; HN2 (amine); Mechloroethamine; Mustine Note; 55-86-7 (chloride)

Phase change data

Data compiled by: William E. Acree, Jr., James S. Chickos
Enthalpy of vaporization
ΔvapH (kJ/mol) | Temperature (K) | Method | Reference | Comment |
---|---|---|---|---|
54.6 | 288. | A | Stephenson and Malanowski, 1987 | Based on data from 273. to 333. K. |

Kovats' RI, non-polar column, isothermal

Column type | Active phase | Temperature (C) | I | Reference | Comment |
---|---|---|---|---|---|
Capillary | Methyl Silicone | 100. | 1052. | Huber, Kenndler, et al., 1993 | H2; Column length: 5. m; Phase thickness: 2.65 μm |
Capillary | Methyl Silicone | 120. | 1058. | Huber, Kenndler, et al., 1993 | H2; Column length: 5. m; Phase thickness: 2.65 μm |

Kovats' RI, polar column, isothermal

Column type | Active phase | Temperature (C) | I | Reference | Comment |
---|---|---|---|---|---|
Capillary | PEG-20M | 130. | 1566. | Huber, Kenndler, et al., 1993 | Column length: 10. m; Phase thickness: 1.33 μm |
Capillary | PEG-20M | 150. | 1574. | Huber, Kenndler, et al., 1993 | Column length: 10. m; Phase thickness: 1.33 μm |
Capillary | PEG-20M | 130. | 1566.3 | Huber, Kenndler, et al., 1993 | Column length: 10. m; Phase thickness: 1.33 μm |

Van Den Dool and Kratz RI, non-polar column, temperature ramp

Column type | Active phase | I | Reference | Comment |
---|---|---|---|---|
Capillary | SE-54 | 1087. | Kostiainen, 2000 | 25. m/0.32 mm/0.25 μm, He, 40. C @ 1. min, 10. K/min, 280. C @ 10. min |
Capillary | SE-54 | 1083.26 | Kaipainen, Kostiainen, et al., 1992 | 25. m/0.32 mm/0.25 μm, He, 40. C @ 1. min, 10. K/min; Tend: 280. C |
Capillary | SE-54 | 1084.87 | Kaipainen, Kostiainen, et al., 1992 | 25. m/0.32 mm/0.25 μm, He, 40. C @ 1. min, 10. K/min; Tend: 280. C |

Normal alkane RI, non-polar column, custom temperature program

Column type | Active phase | I | Reference | Comment |
---|---|---|---|---|
Capillary | 5 % Phenyl methyl siloxane | 1087. | OPCW, 1997 | Program: not specified |

References

Stephenson and Malanowski, 1987
Stephenson, Richard M.; Malanowski, Stanislaw,
Handbook of the Thermodynamics of Organic Compounds, 1987, https://doi.org/10.1007/978-94-009-3173-2
. [all data]
Huber, Kenndler, et al., 1993
Huber, J.F.K.; Kenndler, E.; Reich, G.; Hack, W.; Wolf, J.,
Optimal Selection of Gas Chromatographic Columns for the Analytical Control of Chemical Warfare Agents by Application of Information Theory to Retention Data,
Anal. Chem., 1993, 65, 20, 2903-2906, https://doi.org/10.1021/ac00068a031
. [all data]
Kostiainen, 2000
Kostiainen, O.,
Gas Chromatography in Screening of Chemicals Related to the Chemical Weapons Convention
in Encyclopedia of Analytical Chemistry, Meyers, R.A., ed(s)., John Wiley Sons Ltd, Chichester, 2000, 963-979. [all data]
Kaipainen, Kostiainen, et al., 1992
Kaipainen, A.; Kostiainen, O.; Riekkola, M.-L.,
Identification of chemical warfare agents in air samples using capillary column gas chromatography with three simultaneous detectors,
J. Microcolumn Sep., 1992, 4, 3, 245-251, https://doi.org/10.1002/mcs.1220040311
. [all data]
OPCW, 1997
OPCW,
Conference of the States Parties C-I/DEC.64 (22 May 1997), 1997, retrieved from http://www.opcw.org/html/global/cseries/csp1/CIDEC64.html. [all data]