Hexane, 2,2,4,4-tetramethyl-
- Formula: C10H22
- Molecular weight: 142.2817
- IUPAC Standard InChIKey: PXHNHTBJHHSVPT-UHFFFAOYSA-N
- CAS Registry Number: 51750-65-3
- Chemical structure:
View 3d structure (requires JavaScript / HTML 5) - Other names: 2,2,4,4-Tetramethylhexane

Phase change data

Data compiled by: William E. Acree, Jr., James S. Chickos
Quantity | Value | Units | Method | Reference | Comment |
---|---|---|---|---|---|
ΔvapH° | 43.5 | kJ/mol | N/A | Reid, 1972 |

Kovats' RI, non-polar column, isothermal

View large format table.

Column type Active phase Temperature (C) I Reference Comment
CapillarySqualane100.889.Heinzen, Soares, et al., 1999
CapillarySqualane60.888.6Chretien and Dubois, 1976
CapillaryVacuum Grease Oil (VM-4)95.888.8Sultanov and Arustamova, 1975N2; Column length: 150. m; Column diameter: 0.25 mm
CapillarySqualane100.900.Mitra, Mohan, et al., 1974H2; Column length: 50. m; Column diameter: 0.2 mm
CapillarySqualane60.889.Matukuma, 1969N2; Column length: 91.4 m; Column diameter: 0.25 mm

Normal alkane RI, non-polar column, custom temperature program

View large format table.

Column type Active phase I Reference Comment
CapillaryOV-101889.Du and Liang, 2003Program: not specified
CapillaryPolydimethyl siloxane889.Junkes, Castanho, et al., 2003Program: not specified

References

Reid, 1972
Reid, Robert C.,
Handbook on vapor pressure and heats of vaporization of hydrocarbons and related compounds, R. C. Wilhort and B. J. Zwolinski, Texas A Research Foundation. College Station, Texas(1971). 329 pages.$10.00,
AIChE J., 1972, 18, 6, 1278-1278, https://doi.org/10.1002/aic.690180637
. [all data]