α-Acetobutyrolactone
- Formula: C6H8O3
- Molecular weight: 128.1259
- IUPAC Standard InChIKey: OMQHDIHZSDEIFH-UHFFFAOYSA-N
- CAS Registry Number: 517-23-7
- Chemical structure:
View 3d structure (requires JavaScript / HTML 5) - Other names: 2(3H)-Furanone, 3-acetyldihydro-; α-(2-Hydroxyethyl)acetoacetic acid γ-lactone; α-Acetyl-γ-butyrolactone; α-Acetyl-γ-hydroxybutyric acid γ-lactone; α-Acetylbutyrolactone; 2-Acetyl-γ-butyrolactone; 2-Acetyl-4-hydroxybutyric acid γ-lactone; 2-Acetylbutyrolactone; 2-Oxo-3-acetyltetrahydrofuran; 3-Acetyl-2(3H)-4,5-dihydrofuranone; 3-Acetyltetrahydro-2-furanone; Dihydro-3-acetyl-2(3H)-furanone; NSC 2019

Phase change data

Data compiled by: Robert L. Brown and Stephen E. Stein
Reduced pressure boiling point
Tboil (K) | Pressure (atm) | Reference |
---|---|---|
380.7 | 0.007 | Weast and Grasselli, 1989 |
403. to 406. | 0.024 | Frinton Laboratories Inc., 1986 |
403. to 405. | 0.024 | Buckingham and Donaghy, 1982 |

Normal alkane RI, non-polar column, temperature ramp

Data compiled by: NIST Mass Spectrometry Data Center, William E. Wallace, director

Column type CapillaryCapillary
Active phase HP-5 MSHP-5 MS
Column length (m) 30.30.
Carrier gas  Helium
Substrate
Column diameter (mm) 0.250.25
Phase thickness (μm) 0.250.25
Tstart (C) 60.60.
Tend (C) 300.300.
Heat rate (K/min) 15.15.
Initial hold (min) 2.2.
Final hold (min) 10.10.
I 1108.1108.
ReferenceXu, Han, et al., 2012Xu, Han, et al., 2009
Comment MSDC-RI MSDC-RI

References

Weast and Grasselli, 1989
CRC Handbook of Data on Organic Compounds, 2nd Editon, Weast,R.C and Grasselli, J.G., ed(s)., CRC Press, Inc., Boca Raton, FL, 1989, 1. [all data]
Frinton Laboratories Inc., 1986
Frinton Laboratories Inc.,
Catalog Number 11, Frinton Laboratories Inc., Vineland, NJ, 1986, 99. [all data]
Buckingham and Donaghy, 1982
Buckingham, J.; Donaghy, S.M.,
Dictionary of Organic Compounds: Fifth Edition, Chapman and Hall, New York, 1982, 1. [all data]