1H-Pyrrole, 3-ethyl-2,4-dimethyl-
- Formula: C8H13N
- Molecular weight: 123.1955
- IUPAC Standard InChIKey: ZEBBLOXDLGIMEG-UHFFFAOYSA-N
- CAS Registry Number: 517-22-6
- Chemical structure:
View 3d structure (requires JavaScript / HTML 5) - Other names: Pyrrole, 3-ethyl-2,4-dimethyl-; Cryptopyrrole; Kryptopyrrol; Kryptopyrrole; 2,4-Dimethyl-3-ethylpyrrole; 3-Ethyl-2,4-dimethylpyrrole; 3-Ethyl-2,4-dimethyl-1H-pyrrole; NSC 62025

Phase change data

Data compiled as indicated in comments:
TRC - Thermodynamics Research Center, NIST Boulder Laboratories, Chris Muzny director
BS - Robert L. Brown and Stephen E. Stein
Quantity | Value | Units | Method | Reference | Comment |
---|---|---|---|---|---|
Tboil | 470.45 | K | N/A | Lanum and Morris, 1969 | Uncertainty assigned by TRC = 0.4 K; TRC |
Tboil | 470.5 | K | N/A | Anonymous, 1955 | Uncertainty assigned by TRC = 0.4 K; TRC |
Quantity | Value | Units | Method | Reference | Comment |
Tfus | 286.75 | K | N/A | Lanum and Morris, 1969 | Uncertainty assigned by TRC = 0.2 K; TRC |
Tfus | 286.8 | K | N/A | Anonymous, 1955 | Uncertainty assigned by TRC = 0.3 K; TRC |
Reduced pressure boiling point
Tboil (K) | Pressure (bar) | Reference | Comment |
---|---|---|---|
470.2 | 0.947 | Weast and Grasselli, 1989 | BS |
369.2 | 0.021 | Weast and Grasselli, 1989 | BS |

Normal alkane RI, non-polar column, temperature ramp

Column type | Active phase | I | Reference | Comment |
---|---|---|---|---|
Capillary | SLB-5MS | 988. | Risticevic, Carasek, et al., 2008 | 10. m/0.18 mm/0.18 μm, Helium, 40. C @ 1.5 min, 10. K/min; Tend: 295. C |

References

Lanum and Morris, 1969
Lanum, W.J.; Morris, J.C.,
Physical Properties of Some Sulfur and Nitrogen Compounds,
J. Chem. Eng. Data, 1969, 14, 93-8. [all data]
Anonymous, 1955
Anonymous, R.,
, Am. Pet. Inst. Res. Proj. 45, Tech. Rep. 14, No. 1, Ohio State Univ., 1955. [all data]
Weast and Grasselli, 1989
CRC Handbook of Data on Organic Compounds, 2nd Editon, Weast,R.C and Grasselli, J.G., ed(s)., CRC Press, Inc., Boca Raton, FL, 1989, 1. [all data]
Risticevic, Carasek, et al., 2008
Risticevic, S.; Carasek, E.; Pawliszyn, J.,
Headspace solid-phase microextraction-gas chromatographic-time-of-flight mass spectrometric methodology for geographical origin verification of coffee,
Anal. Chim. Acta, 2008, 617, 1-2, 72-84, https://doi.org/10.1016/j.aca.2008.04.009
. [all data]